{"text_format":"1","workbook":"xlsx","n_sheets":11,"sheets":["ReadMe","Base Values","HVI & Yield Entry","Premiums & Discounts","Yield & Return","Staple Lookup","G&S","Str","Mic","Uni","Ext"],"not_rendered":{"charts":0,"images":1,"macros":1,"external_links":1,"defined_names":2,"comments":0,"pivot_tables":0},"unopened":[],"bounds":{"document_bytes":16777216,"sheet_cells":100000,"rows_first":2000,"rows_last":500,"rows_between":2000,"halvings":0,"cell_chars":16384,"cell_head_chars":4096},"cells_cut":0,"cells_raw":0,"read":"whole","date_system":"1900"}

{"sheet":"ReadMe","index":0,"n_rows":35,"n_cols":1,"rows_kept":35,"cut":false,"hidden":false,"merged":[]}
[]
[]
[]
["Two data entry sheets (Base Values and HVI & Yield Entry)"]
["Two output sheets (Premiums & Discounts and Yield & Return)"]
[]
["Step 1 - Base Values sheet"]
["Check/enter cells of base data for the loan value, seed value, costs, and turnout."]
["These values are applied to Yield & Return calculations."]
[]
{"$rows_left_out":26}
{"sheet":"Base Values","index":1,"n_rows":14,"n_cols":3,"rows_kept":14,"cut":false,"hidden":false,"merged":[]}
["Enter Base Values"]
[]
[null,"Base Values","Value Units"]
["Study/Test Title","2022/23 Sample Loan Values","n/a"]
[]
["Base Quality Price (41 Color, 4 Leaf, 34 Staple)",52,"cents/lb"]
[]
["Cottonseed Value (USD/ton)",185,"USD/ton"]
[]
["Picking/Stripping & Moduling Cost per Cwt of Seed Cotton",3.2,"USD/Cwt"]
{"$rows_left_out":5}
{"sheet":"HVI & Yield Entry","index":2,"n_rows":68,"n_cols":15,"rows_kept":68,"cut":false,"hidden":false,"merged":[[4,9,4,12]]}
["Enter HVI Data"]
["HVI data can either be imported or pasted"]
[]
["Import HVI Data"]
["HVI data from sources/labs with known formatting can be",null,null,null,null,null,null,null,null,"Extraneous Matter (blanks treated as 0)"]
["imported with the buttons below.  After you locate the file, the",null,null,null,null,null,null,null,null,"Bark",null,null,null,"Lint Yield","Turnout"]
["data will appear here and on the Premiums & Discount sheet.",null,"Sample Name/Code","Color","Leaf","Mic","Length","Strength","Uniformity","TX/NM/OK/KS","Prep","Other","Plastic","(lbs acre)","(%)"]
[null,null,1915001,31,3,4.0999999999999996,1.2,31,82]
[null,null,1915002,31,3,4.4000000000000004,1.24,29,83.7]
[null,null,1915003,41,4,4.5999999999999996,1.1499999999999999,28.4,82.2]
{"$rows_left_out":59}
{"sheet":"Premiums & Discounts","index":3,"n_rows":68,"n_cols":34,"rows_kept":68,"cut":false,"hidden":false,"merged":[[4,7,4,10],[4,13,4,17],[5,22,5,25]]}
["Premiums & Discounts"]
["Uses HVI data from HVI & Yield Entry sheet"]
[]
[]
[null,null,null,null,null,null,null,"Extraneous Matter (blanks treated as 0)",null,null,null,null,null,"Premiums & Discounts",null,null,null,null,null,"Net ","Loan",null,"These columns break out the discount for extraneous matter by type",null,null,null,null,null,null,null,null,null,"Mic Premium Eligibility"]
[null,null,null,null,null,null,null,"Bark",null,null,null,null,null,"Grade & ",null,null,"Ext",null,null,"Premium","Value",null,"Extraneous Matter Breakout",null,null,null,null,null,null,null,null,null,"Micronaire only eligible for certain windows of color/leaf"]
["Sample Name/Code","Color","Leaf","Mic","Length","Strength","Uniformity","TX/NM/OK/KS","Prep","Other","Plastic","Staple",null,"Length","Strength","Mic","Matter","Uniformity",null,"(points)","(cents/lb)",null,"TX/NM/OK/KS","Prep","Other","Plastic",null,"38+","26-31","n/a","Normal",null,"a/ Premium applies only to white grades 11-41, leaf 1-6; 51, leaf 1-5; light spotted grades 12-32, leaf 1-5; 42, leaf 1-4; and 52, leaf 1-3.","Raw Mic PD"]
[1915001,31,3,4.0999999999999996,1.2,31,82,null,null,null,null,{"$f":"IF(LEN(A8)=0,\"\",IF(LEN(E8)=0,\"HVI data needed\",INDEX('Staple Lookup'!$C$3:$C$100,MATCH(TRUE,'Staple Lookup'!$B$3:$B$100>=E8,0))))","v":38},null,{"$f":"IF(OR(LEN(B8)=0,LEN(C8)=0,LEN(D8)=0),\"\",IF(AND(RIGHT(B8,1)*1=1,C8=8),-2000,IF(L8>=38,AB8,IF(L8<=31,AC8,AE8))))","v":420},{"$f":"IF(LEN(A8)=0,\"\",INDEX(Str!$C$1:$C$18,MATCH(F8,Str!$A$1:$A$18,1)))","v":30},{"$f":"IF(LEN(A8)=0,\"\",IF(AND(AG8=1,AH8>0),AH8,IF(AND(AG8=0,AH8>0),0,AH8)))","v":5},{"$f":"IF(LEN(A8)=0,\"\",SUM(W8:Z8))","v":0},{"$f":"IF(LEN(A8)=0,\"\",INDEX(Uni!$C$1:$C$20,MATCH($G8,Uni!$A$1:$A$20,1)))","v":5},null,{"$f":"IF(LEN(A8)=0,\"\",IF(OR(LEN(B8)=0,LEN(C8)=0,LEN(D8)=0,LEN(E8)=0,LEN(F8)=0,LEN(G8)=0),\"no HVI data\",SUM(N8:R8)))","v":460},{"$f":"IF(LEN(A8)=0,\"\",IF(OR(LEN(B8)=0,LEN(C8)=0,LEN(D8)=0,LEN(E8)=0,LEN(F8)=0,LEN(G8)=0),\"no HVI data\",IF('Base Values'!$B$6+(SUM($N8:$R8)/100)<0,0,'Base Values'!$B$6+(SUM(N8:R8)/100))))","v":56.6},null,{"$f":"IF(LEN(A8)=0,\"\",IF(LEN(H8)=0,INDEX(Ext!$A$1:$G$5,MATCH(0,Ext!$A$1:$A$5,0),MATCH(H$7,Ext!$A$2:$E$2,0)),IF(AND(H8>=0,H8<3),INDEX(Ext!$A$1:$G$5,MATCH(H8,Ext!$A$1:$A$5,0),MATCH(H$7,Ext!$A$2:$E$2,0)),\"invalid entry\")))","v":0},{"$f":"IF(LEN(B8)=0,\"\",IF(LEN(I8)=0,INDEX(Ext!$A$1:$G$5,MATCH(0,Ext!$A$1:$A$5,0),MATCH(I$7,Ext!$A$2:$E$2,0)),IF(AND(I8>=0,I8<3),INDEX(Ext!$A$1:$G$5,MATCH(I8,Ext!$A$1:$A$5,0),MATCH(I$7,Ext!$A$2:$E$2,0)),\"invalid entry\")))","v":0},{"$f":"IF(LEN(C8)=0,\"\",IF(LEN(J8)=0,INDEX(Ext!$A$1:$G$5,MATCH(0,Ext!$A$1:$A$5,0),MATCH(J$7,Ext!$A$2:$E$2,0)),IF(AND(J8>=0,J8<3),INDEX(Ext!$A$1:$G$5,MATCH(J8,Ext!$A$1:$A$5,0),MATCH(J$7,Ext!$A$2:$E$2,0)),\"invalid entry\")))","v":0},{"$f":"IF(LEN(D8)=0,\"\",IF(LEN(K8)=0,INDEX(Ext!$A$1:$G$5,MATCH(0,Ext!$A$1:$A$5,0),MATCH(K$7,Ext!$A$2:$E$2,0)),IF(AND(K8>=0,K8<3),INDEX(Ext!$A$1:$G$5,MATCH(K8,Ext!$A$1:$A$5,0),MATCH(K$7,Ext!$A$2:$E$2,0)),\"invalid entry\")))","v":0},null,{"$f":"IF(ISNA(INDEX('G&S'!$A$1:$K$1000,MATCH($B8&$C8,'G&S'!$B$1:$B$1000&'G&S'!$C$1:$C$1000,0),MATCH(\"38+\",'G&S'!$A$3:$K$3,0))),-4000,INDEX('G&S'!$A$1:$K$1000,MATCH($B8&$C8,'G&S'!$B$1:$B$1000&'G&S'!$C$1:$C$1000,0),MATCH(\"38+\",'G&S'!$A$3:$K$3,0)))","v":420},{"$f":"IF(ISNA(INDEX('G&S'!$A$1:$K$1000,MATCH($B8&$C8,'G&S'!$B$1:$B$1000&'G&S'!$C$1:$C$1000,0),MATCH(\"26-31\",'G&S'!$A$3:$K$3,0))),-4000,INDEX('G&S'!$A$1:$K$1000,MATCH($B8&$C8,'G&S'!$B$1:$B$1000&'G&S'!$C$1:$C$1000,0),MATCH(\"26-31\",'G&S'!$A$3:$K$3,0)))","v":-530},{"$f":"IF(ISNA(INDEX('G&S'!$A$1:$K$1000,MATCH($B8&$C8,'G&S'!$B$1:$B$1000&'G&S'!$C$1:$C$1000,0),MATCH($L8,'G&S'!$A$3:$K$3,0))),-4000,INDEX('G&S'!$A$1:$K$1000,MATCH($B8&$C8,'G&S'!$B$1:$B$1000&'G&S'!$C$1:$C$1000,0),MATCH($L8,'G&S'!$A$3:$K$3,0)))","v":-4000},{"$f":"IF(ISNA(INDEX('G&S'!$A$1:$K$1000,MATCH($B8&$C8,'G&S'!$B$1:$B$1000&'G&S'!$C$1:$C$1000,0),MATCH($L8,'G&S'!$A$3:$K$3,0))),-4000,INDEX('G&S'!$A$1:$K$1000,MATCH($B8&$C8,'G&S'!$B$1:$B$1000&'G&S'!$C$1:$C$1000,0),MATCH($L8,'G&S'!$A$3:$K$3,0)))","v":-4000},null,{"$f":"IF(LEN(A8)=0,\"\",IF(AND(RIGHT(B8,1)=\"1\",B8>=11,B8<=41,C8<=6),1,IF(AND(RIGHT(B8,1)=\"1\",B8=51,C8<=5),1,IF(AND(RIGHT(B8,1)=\"2\",B8>=12,B8<=32,C8<=5),1,IF(AND(RIGHT(B8,1)=\"2\",B8=42,C8<=4),1,IF(AND(RIGHT(B8,1)=\"2\",B8=52,C8<=3),1,0))))))","v":1},{"$f":"IF(LEN(A8)=0,\"\",INDEX(Mic!$C$1:$C$20,MATCH($D8,Mic!$A$1:$A$20,1)))","v":5}]
[1915002,31,3,4.4000000000000004,1.24,29,83.7,null,null,null,null,{"$f":"IF(LEN(A9)=0,\"\",IF(LEN(E9)=0,\"HVI data needed\",INDEX('Staple Lookup'!$C$3:$C$100,MATCH(TRUE,'Staple Lookup'!$B$3:$B$100>=E9,0))))","v":40},null,{"$f":"IF(OR(LEN(B9)=0,LEN(C9)=0,LEN(D9)=0),\"\",IF(AND(RIGHT(B9,1)*1=1,C9=8),-2000,IF(L9>=38,AB9,IF(L9<=31,AC9,AE9))))","v":420},{"$f":"IF(LEN(A9)=0,\"\",INDEX(Str!$C$1:$C$18,MATCH(F9,Str!$A$1:$A$18,1)))","v":5},{"$f":"IF(LEN(A9)=0,\"\",IF(AND(AG9=1,AH9>0),AH9,IF(AND(AG9=0,AH9>0),0,AH9)))","v":0},{"$f":"IF(LEN(A9)=0,\"\",SUM(W9:Z9))","v":0},{"$f":"IF(LEN(A9)=0,\"\",INDEX(Uni!$C$1:$C$20,MATCH($G9,Uni!$A$1:$A$20,1)))","v":10},null,{"$f":"IF(LEN(A9)=0,\"\",IF(OR(LEN(B9)=0,LEN(C9)=0,LEN(D9)=0,LEN(E9)=0,LEN(F9)=0,LEN(G9)=0),\"no HVI data\",SUM(N9:R9)))","v":435},{"$f":"IF(LEN(A9)=0,\"\",IF(OR(LEN(B9)=0,LEN(C9)=0,LEN(D9)=0,LEN(E9)=0,LEN(F9)=0,LEN(G9)=0),\"no HVI data\",IF('Base Values'!$B$6+(SUM($N9:$R9)/100)<0,0,'Base Values'!$B$6+(SUM(N9:R9)/100))))","v":56.35},null,{"$f":"IF(LEN(A9)=0,\"\",IF(LEN(H9)=0,INDEX(Ext!$A$1:$G$5,MATCH(0,Ext!$A$1:$A$5,0),MATCH(H$7,Ext!$A$2:$E$2,0)),IF(AND(H9>=0,H9<3),INDEX(Ext!$A$1:$G$5,MATCH(H9,Ext!$A$1:$A$5,0),MATCH(H$7,Ext!$A$2:$E$2,0)),\"invalid entry\")))","v":0},{"$f":"IF(LEN(B9)=0,\"\",IF(LEN(I9)=0,INDEX(Ext!$A$1:$G$5,MATCH(0,Ext!$A$1:$A$5,0),MATCH(I$7,Ext!$A$2:$E$2,0)),IF(AND(I9>=0,I9<3),INDEX(Ext!$A$1:$G$5,MATCH(I9,Ext!$A$1:$A$5,0),MATCH(I$7,Ext!$A$2:$E$2,0)),\"invalid entry\")))","v":0},{"$f":"IF(LEN(C9)=0,\"\",IF(LEN(J9)=0,INDEX(Ext!$A$1:$G$5,MATCH(0,Ext!$A$1:$A$5,0),MATCH(J$7,Ext!$A$2:$E$2,0)),IF(AND(J9>=0,J9<3),INDEX(Ext!$A$1:$G$5,MATCH(J9,Ext!$A$1:$A$5,0),MATCH(J$7,Ext!$A$2:$E$2,0)),\"invalid entry\")))","v":0},{"$f":"IF(LEN(D9)=0,\"\",IF(LEN(K9)=0,INDEX(Ext!$A$1:$G$5,MATCH(0,Ext!$A$1:$A$5,0),MATCH(K$7,Ext!$A$2:$E$2,0)),IF(AND(K9>=0,K9<3),INDEX(Ext!$A$1:$G$5,MATCH(K9,Ext!$A$1:$A$5,0),MATCH(K$7,Ext!$A$2:$E$2,0)),\"invalid entry\")))","v":0},null,{"$f":"IF(ISNA(INDEX('G&S'!$A$1:$K$1000,MATCH($B9&$C9,'G&S'!$B$1:$B$1000&'G&S'!$C$1:$C$1000,0),MATCH(\"38+\",'G&S'!$A$3:$K$3,0))),-4000,INDEX('G&S'!$A$1:$K$1000,MATCH($B9&$C9,'G&S'!$B$1:$B$1000&'G&S'!$C$1:$C$1000,0),MATCH(\"38+\",'G&S'!$A$3:$K$3,0)))","v":420},{"$f":"IF(ISNA(INDEX('G&S'!$A$1:$K$1000,MATCH($B9&$C9,'G&S'!$B$1:$B$1000&'G&S'!$C$1:$C$1000,0),MATCH(\"26-31\",'G&S'!$A$3:$K$3,0))),-4000,INDEX('G&S'!$A$1:$K$1000,MATCH($B9&$C9,'G&S'!$B$1:$B$1000&'G&S'!$C$1:$C$1000,0),MATCH(\"26-31\",'G&S'!$A$3:$K$3,0)))","v":-530},{"$f":"IF(ISNA(INDEX('G&S'!$A$1:$K$1000,MATCH($B9&$C9,'G&S'!$B$1:$B$1000&'G&S'!$C$1:$C$1000,0),MATCH($L9,'G&S'!$A$3:$K$3,0))),-4000,INDEX('G&S'!$A$1:$K$1000,MATCH($B9&$C9,'G&S'!$B$1:$B$1000&'G&S'!$C$1:$C$1000,0),MATCH($L9,'G&S'!$A$3:$K$3,0)))","v":-4000},{"$f":"IF(ISNA(INDEX('G&S'!$A$1:$K$1000,MATCH($B9&$C9,'G&S'!$B$1:$B$1000&'G&S'!$C$1:$C$1000,0),MATCH($L9,'G&S'!$A$3:$K$3,0))),-4000,INDEX('G&S'!$A$1:$K$1000,MATCH($B9&$C9,'G&S'!$B$1:$B$1000&'G&S'!$C$1:$C$1000,0),MATCH($L9,'G&S'!$A$3:$K$3,0)))","v":-4000},null,{"$f":"IF(LEN(A9)=0,\"\",IF(AND(RIGHT(B9,1)=\"1\",B9>=11,B9<=41,C9<=6),1,IF(AND(RIGHT(B9,1)=\"1\",B9=51,C9<=5),1,IF(AND(RIGHT(B9,1)=\"2\",B9>=12,B9<=32,C9<=5),1,IF(AND(RIGHT(B9,1)=\"2\",B9=42,C9<=4),1,IF(AND(RIGHT(B9,1)=\"2\",B9=52,C9<=3),1,0))))))","v":1},{"$f":"IF(LEN(A9)=0,\"\",INDEX(Mic!$C$1:$C$20,MATCH($D9,Mic!$A$1:$A$20,1)))","v":0}]
[1915003,41,4,4.5999999999999996,1.1499999999999999,28.4,82.2,null,null,null,null,{"$f":"IF(LEN(A10)=0,\"\",IF(LEN(E10)=0,\"HVI data needed\",INDEX('Staple Lookup'!$C$3:$C$100,MATCH(TRUE,'Staple Lookup'!$B$3:$B$100>=E10,0))))","v":37},null,{"$f":"IF(OR(LEN(B10)=0,LEN(C10)=0,LEN(D10)=0),\"\",IF(AND(RIGHT(B10,1)*1=1,C10=8),-2000,IF(L10>=38,AB10,IF(L10<=31,AC10,AE10))))","v":145},{"$f":"IF(LEN(A10)=0,\"\",INDEX(Str!$C$1:$C$18,MATCH(F10,Str!$A$1:$A$18,1)))","v":0},0,0,{"$f":"IF(LEN(A10)=0,\"\",INDEX(Uni!$C$1:$C$20,MATCH($G10,Uni!$A$1:$A$20,1)))","v":5},null,150,{"$f":"IF(LEN(A10)=0,\"\",IF(OR(LEN(B10)=0,LEN(C10)=0,LEN(D10)=0,LEN(E10)=0,LEN(F10)=0,LEN(G10)=0),\"no HVI data\",IF('Base Values'!$B$6+(SUM($N10:$R10)/100)<0,0,'Base Values'!$B$6+(SUM(N10:R10)/100))))","v":53.5},null,{"$f":"IF(LEN(A10)=0,\"\",IF(LEN(H10)=0,INDEX(Ext!$A$1:$G$5,MATCH(0,Ext!$A$1:$A$5,0),MATCH(H$7,Ext!$A$2:$E$2,0)),IF(AND(H10>=0,H10<3),INDEX(Ext!$A$1:$G$5,MATCH(H10,Ext!$A$1:$A$5,0),MATCH(H$7,Ext!$A$2:$E$2,0)),\"invalid entry\")))","v":0},{"$f":"IF(LEN(B10)=0,\"\",IF(LEN(I10)=0,INDEX(Ext!$A$1:$G$5,MATCH(0,Ext!$A$1:$A$5,0),MATCH(I$7,Ext!$A$2:$E$2,0)),IF(AND(I10>=0,I10<3),INDEX(Ext!$A$1:$G$5,MATCH(I10,Ext!$A$1:$A$5,0),MATCH(I$7,Ext!$A$2:$E$2,0)),\"invalid entry\")))","v":0},{"$f":"IF(LEN(C10)=0,\"\",IF(LEN(J10)=0,INDEX(Ext!$A$1:$G$5,MATCH(0,Ext!$A$1:$A$5,0),MATCH(J$7,Ext!$A$2:$E$2,0)),IF(AND(J10>=0,J10<3),INDEX(Ext!$A$1:$G$5,MATCH(J10,Ext!$A$1:$A$5,0),MATCH(J$7,Ext!$A$2:$E$2,0)),\"invalid entry\")))","v":0},{"$f":"IF(LEN(D10)=0,\"\",IF(LEN(K10)=0,INDEX(Ext!$A$1:$G$5,MATCH(0,Ext!$A$1:$A$5,0),MATCH(K$7,Ext!$A$2:$E$2,0)),IF(AND(K10>=0,K10<3),INDEX(Ext!$A$1:$G$5,MATCH(K10,Ext!$A$1:$A$5,0),MATCH(K$7,Ext!$A$2:$E$2,0)),\"invalid entry\")))","v":0},null,{"$f":"IF(ISNA(INDEX('G&S'!$A$1:$K$1000,MATCH($B10&$C10,'G&S'!$B$1:$B$1000&'G&S'!$C$1:$C$1000,0),MATCH(\"38+\",'G&S'!$A$3:$K$3,0))),-4000,INDEX('G&S'!$A$1:$K$1000,MATCH($B10&$C10,'G&S'!$B$1:$B$1000&'G&S'!$C$1:$C$1000,0),MATCH(\"38+\",'G&S'!$A$3:$K$3,0)))","v":155},{"$f":"IF(ISNA(INDEX('G&S'!$A$1:$K$1000,MATCH($B10&$C10,'G&S'!$B$1:$B$1000&'G&S'!$C$1:$C$1000,0),MATCH(\"26-31\",'G&S'!$A$3:$K$3,0))),-4000,INDEX('G&S'!$A$1:$K$1000,MATCH($B10&$C10,'G&S'!$B$1:$B$1000&'G&S'!$C$1:$C$1000,0),MATCH(\"26-31\",'G&S'!$A$3:$K$3,0)))","v":-690},{"$f":"IF(ISNA(INDEX('G&S'!$A$1:$K$1000,MATCH($B10&$C10,'G&S'!$B$1:$B$1000&'G&S'!$C$1:$C$1000,0),MATCH($L10,'G&S'!$A$3:$K$3,0))),-4000,INDEX('G&S'!$A$1:$K$1000,MATCH($B10&$C10,'G&S'!$B$1:$B$1000&'G&S'!$C$1:$C$1000,0),MATCH($L10,'G&S'!$A$3:$K$3,0)))","v":145},{"$f":"IF(ISNA(INDEX('G&S'!$A$1:$K$1000,MATCH($B10&$C10,'G&S'!$B$1:$B$1000&'G&S'!$C$1:$C$1000,0),MATCH($L10,'G&S'!$A$3:$K$3,0))),-4000,INDEX('G&S'!$A$1:$K$1000,MATCH($B10&$C10,'G&S'!$B$1:$B$1000&'G&S'!$C$1:$C$1000,0),MATCH($L10,'G&S'!$A$3:$K$3,0)))","v":145},null,1,{"$f":"IF(LEN(A10)=0,\"\",INDEX(Mic!$C$1:$C$20,MATCH($D10,Mic!$A$1:$A$20,1)))","v":0}]
{"$rows_left_out":59}
{"sheet":"Yield & Return","index":4,"n_rows":7,"n_cols":10,"rows_kept":7,"cut":false,"hidden":false,"merged":[]}
["Yield & Return"]
["Required lint yield & turnout data to be entered on"]
["HVI & Yield Entry sheet (columns N:O)"]
[null,null,null,"Seed Yield","Lint Value","Seed Value","Gross Return","Picking/Stripping","Ginning Cost","Net Return"]
[null,null,null,"Equals Column B x","Equals Column B x","Equals Column D x","Equals Column E +","& Moduling Costs","Equals Column B x","Equals Column B -"]
[null,"Lint Yield","Turnout","Base Values B14","Loan Value","Base Values B8","Column F","=B/C * Base Values B10","Base Values B12","Columns H & I"]
["Sample Name/Code","(lbs acre)","(%)","(lbs acre)","($/acre)","($/acre)","($/acre)","($/acre)","($/acre)","($/acre)"]

{"sheet":"Staple Lookup","index":5,"n_rows":21,"n_cols":3,"rows_kept":21,"cut":false,"hidden":true,"merged":[]}
[null,"Decimal"]
["Floor","Ceiling","Staple"]
[0,0.79,24]
[{"$f":"B3+0.01","v":0.8},0.85,26]
[{"$f":"B4+0.01","v":0.86},0.89,28]
[0.9,0.92,29]
[0.93,0.95,30]
[0.96,0.98,31]
[0.99,1.01,32]
[1.02,1.04,33]
{"$rows_left_out":12}
{"sheet":"G&S","index":6,"n_rows":165,"n_cols":13,"rows_kept":165,"cut":false,"hidden":true,"merged":[]}
[null,null,null,null,null,null,null,null,null,null,null,null,"Note: Data have to be manually copied over from the pdf (then transposed)"]
[null,null,null,null,null,null,null,null,null,null,null,null,"New section created to break out color grades 11 and 21"]
[null,"Color","Leaf","26-31",32,33,34,35,36,37,"38+",null,"Gaps in coverage are assigned -4000, handled by formulas."]
["White",11,1,-365,-250,-80,145,300,440,495,505]
["White",11,2,-365,-250,-80,145,300,440,495,505]
["White",11,3,-440,-285,-105,120,250,400,445,455]
["White",11,4,-485,-305,-190,65,155,295,330,330]
["White",11,5,-555,-440,-320,-100,20,95,120,120]
["White",11,6,-700,-545,-470,-290,-245,-200,-190,-190]
["White",11,7,-775,-640,-575,-385,-335,-290,-280,-280]
{"$rows_left_out":156}
{"sheet":"Str","index":7,"n_rows":18,"n_cols":3,"rows_kept":18,"cut":false,"hidden":true,"merged":[]}
["Strength"]
["Lower","Upper","Points"]
[0,17.899999999999999,-600]
[18,18.899999999999999,-515]
[19,19.899999999999999,-515]
[20,20.9,-510]
[21,21.9,-505]
[22,22.9,-480]
[23,23.9,-465]
[24,24.9,-455]
{"$rows_left_out":9}
{"sheet":"Mic","index":8,"n_rows":12,"n_cols":3,"rows_kept":12,"cut":false,"hidden":true,"merged":[]}
["Micronaire"]
["Lower","Upper","Points"]
[0,2.4,-1840]
[2.5,2.6,-1414]
[2.7,2.9,-950]
[3,3.2,-650]
[3.3,3.4,-475]
[3.5,3.6,0]
[3.7,4.2,5]
[4.3,4.9000000000000004,0]
{"$rows_left_out":3}
{"sheet":"Uni","index":9,"n_rows":12,"n_cols":3,"rows_kept":12,"cut":false,"hidden":true,"merged":[]}
["Length Uniformity"]
["Lower","Upper","Points"]
[0,77.900000000000006,-90]
[78,78.900000000000006,-60]
[79,79.900000000000006,-50]
[80,80.900000000000006,0]
[81,81.900000000000006,0]
[82,82.9,5]
[83,83.9,10]
[84,84.9,15]
{"$rows_left_out":3}
{"sheet":"Ext","index":10,"n_rows":5,"n_cols":5,"rows_kept":5,"cut":false,"hidden":true,"merged":[]}
["Extraneous Matter"]
[null,"TX/NM/OK/KS","Prep","Other","Plastic"]
[0,0,0,0,0]
[1,-350,-200,-465,-4000]
[2,-525,-670,-650,-4000]