{"text_format":"1","workbook":"xlsx","n_sheets":10,"sheets":["Main Menu","Base Values","HVI Quality Data","Yield and Turnout Data","Charts - Loan Value","Charts - Net Return","Loan - Grade & Staple & Leaf","Loan - Strength","Loan - Micronaire","Loan - Extraneous"],"not_rendered":{"charts":5,"images":1,"macros":1,"external_links":1,"defined_names":4,"comments":2,"pivot_tables":0},"unopened":[],"bounds":{"document_bytes":16777216,"sheet_cells":100000,"rows_first":2000,"rows_last":500,"rows_between":2000,"halvings":0,"cell_chars":16384,"cell_head_chars":4096},"cells_cut":0,"cells_raw":0,"read":"whole","date_system":"1900"}

{"sheet":"Main Menu","index":0,"n_rows":23,"n_cols":2,"rows_kept":23,"cut":false,"hidden":false,"merged":[]}
[]
[]
[]
[]
[]
[]
[]
[]
[]
[]
[]
[]
[]
[]
[]
[]
[]
[]
[]
[]
{"$rows_left_out":4}
{"sheet":"Base Values","index":1,"n_rows":16,"n_cols":3,"rows_kept":16,"cut":false,"hidden":false,"merged":[]}
[]
[]
[]
[]
[null,"Base Values","Value Units"]
["Study/Test Title (used in report & chart titles produced through this program)","2017/18 Sample Loan Values","n/a"]
[]
["Base quality price ",79.77,"cents/lb"]
[]
["Cottonseed Value (USD/ton)",185,"USD/ton"]
[]
["Picking/Stripping & Moduling Cost per Cwt of Seed Cotton",3.2,"USD/acre"]
[]
["Ginning Cost per Pound of Lint",0.12,"USD/lb"]
[]
["Pounds of Seed per Pound of Lint",1.4119999999999999,"lb of seed/lb of lint"]

{"sheet":"HVI Quality Data","index":2,"n_rows":24,"n_cols":18,"rows_kept":24,"cut":false,"hidden":false,"merged":[[12,6,12,7]]}
["Enter HVI Quality Data for Each Sample"]
["Enter HVI data in columns A to H."]
[null,null,null,null,null,null,null,"Note: Staple lengths below 44 (1.375\") not eligible for ELS loan."]
[null,null,null,null,null,null,null,"Note: There are no premiums/discounts for uniformity for ELS."]
[null,null,null,null,null,null,null,"Note: Extraneous matter readings are 0, 1, or 2.  Blank cells for extraneous matter are treated as 0."]
[null,null,null,null,null,null,null,"link to USDA loan tables"]
[]
[null,null,"Note: Click the Refresh button to update/extend formulas in columns I-O to all rows with data."]
[]
[null,null,null,null,null,null,null,null,null,"Loan Rate"]
[null,null,null,null,null,null,null,null,null,"Based on","Strength","Mike",null,"Net","Net"]
[null,null,null,null,null,null,null,null,null,"Staple,","Premium","Premium","Extraneous","Premium","Loan"]
[null,null,null,null,null,null,"Extraneous Matter",null,null,"Color, &","or","or","Matter","or","Price"]
["Variety/Sample Name","Color","Leaf","Length (inches)","Strength","Mike","Preparation","Other","Staple (32nds)","Leaf","Discount","Discount","Discount","Discount","(cents/lb)",null,"Prep All Locations","Other"]
["Variety 1",1,1,1.375,35.4,2.4,0,1,{"$f":"IF(LEN(D15)=0,\"data needed\",ROUND(D15*32,0))","v":44},{"$f":"IF(OR(LEN(B15)=0,LEN(C15)=0,LEN(D15)=0),\"data needed\",IF(I15<44,\"staple too short for ELS loan\",INDEX('Loan - Grade & Staple & Leaf'!$A$1:$E$10,MATCH($B15,'Loan - Grade & Staple & Leaf'!$B$1:$B$10,0),MATCH($I15,'Loan - Grade & Staple & Leaf'!$A$3:$E$3,1))+'Loan - Grade & Staple & Leaf'!O15))","v":76.900000000000006},{"$f":"IF(LEN(E15)=0,\"data needed\",INDEX('Loan - Strength'!$C$1:$C$18,MATCH(E15,'Loan - Strength'!$A$1:$A$18,1)))","v":-1350},{"$f":"IF(LEN(F15)=0,\"data needed\",INDEX('Loan - Micronaire'!$C$1:$C$20,MATCH($F15,'Loan - Micronaire'!$A$1:$A$20,1)))","v":-1915},{"$f":"SUM(Q15:R15)","v":-715},{"$f":"IF(OR(LEN(B15)=0,LEN(C15)=0,LEN(D15)=0,LEN(E15)=0,LEN(F15)=0),\"data needed\",SUM(K15:M15))","v":-3980},{"$f":"IF(OR(LEN(B15)=0,LEN(C15)=0,LEN(D15)=0,LEN(E15)=0,LEN(F15)=0),\"data needed\",IF(J15+N15/100<0,0,J15+N15/100))","v":37.100000000000009},null,{"$f":"IF(G15=1,'Loan - Extraneous'!$B$3,IF(G15=2,'Loan - Extraneous'!$C$3,0))","v":0},{"$f":"IF(H15=1,'Loan - Extraneous'!$B$4,IF(H15=2,'Loan - Extraneous'!$C$4,0))","v":-715}]
["Variety 2",1,2,1.375,36.4,2.6,1,2,{"$f":"IF(LEN(D16)=0,\"data needed\",ROUND(D16*32,0))","v":44},{"$f":"IF(OR(LEN(B16)=0,LEN(C16)=0,LEN(D16)=0),\"data needed\",IF(I16<44,\"staple too short for ELS loan\",INDEX('Loan - Grade & Staple & Leaf'!$A$1:$E$10,MATCH($B16,'Loan - Grade & Staple & Leaf'!$B$1:$B$10,0),MATCH($I16,'Loan - Grade & Staple & Leaf'!$A$3:$E$3,1))+'Loan - Grade & Staple & Leaf'!O16))","v":76.900000000000006},{"$f":"IF(LEN(E16)=0,\"data needed\",INDEX('Loan - Strength'!$C$1:$C$18,MATCH(E16,'Loan - Strength'!$A$1:$A$18,1)))","v":-1100},{"$f":"IF(LEN(F16)=0,\"data needed\",INDEX('Loan - Micronaire'!$C$1:$C$20,MATCH($F16,'Loan - Micronaire'!$A$1:$A$20,1)))","v":-1915},{"$f":"SUM(Q16:R16)","v":-1845},{"$f":"IF(OR(LEN(B16)=0,LEN(C16)=0,LEN(D16)=0,LEN(E16)=0,LEN(F16)=0),\"data needed\",SUM(K16:M16))","v":-4860},{"$f":"IF(OR(LEN(B16)=0,LEN(C16)=0,LEN(D16)=0,LEN(E16)=0,LEN(F16)=0),\"data needed\",IF(J16+N16/100<0,0,J16+N16/100))","v":28.300000000000004},null,{"$f":"IF(G16=1,'Loan - Extraneous'!$B$3,IF(G16=2,'Loan - Extraneous'!$C$3,0))","v":-810},{"$f":"IF(H16=1,'Loan - Extraneous'!$B$4,IF(H16=2,'Loan - Extraneous'!$C$4,0))","v":-1035}]
["Variety 3",2,3,1.4,37.4,2.8,2,0,45,{"$f":"IF(OR(LEN(B17)=0,LEN(C17)=0,LEN(D17)=0),\"data needed\",IF(I17<44,\"staple too short for ELS loan\",INDEX('Loan - Grade & Staple & Leaf'!$A$1:$E$10,MATCH($B17,'Loan - Grade & Staple & Leaf'!$B$1:$B$10,0),MATCH($I17,'Loan - Grade & Staple & Leaf'!$A$3:$E$3,1))+'Loan - Grade & Staple & Leaf'!O17))","v":73.149999999999991},{"$f":"IF(LEN(E17)=0,\"data needed\",INDEX('Loan - Strength'!$C$1:$C$18,MATCH(E17,'Loan - Strength'!$A$1:$A$18,1)))","v":-850},{"$f":"IF(LEN(F17)=0,\"data needed\",INDEX('Loan - Micronaire'!$C$1:$C$20,MATCH($F17,'Loan - Micronaire'!$A$1:$A$20,1)))","v":-1420},-1095,-3365,39.499999999999993,null,{"$f":"IF(G17=1,'Loan - Extraneous'!$B$3,IF(G17=2,'Loan - Extraneous'!$C$3,0))","v":-1095},{"$f":"IF(H17=1,'Loan - Extraneous'!$B$4,IF(H17=2,'Loan - Extraneous'!$C$4,0))","v":0}]
["Variety 4",3,4,1.4,38.4,3.05,0,1,45,{"$f":"IF(OR(LEN(B18)=0,LEN(C18)=0,LEN(D18)=0),\"data needed\",IF(I18<44,\"staple too short for ELS loan\",INDEX('Loan - Grade & Staple & Leaf'!$A$1:$E$10,MATCH($B18,'Loan - Grade & Staple & Leaf'!$B$1:$B$10,0),MATCH($I18,'Loan - Grade & Staple & Leaf'!$A$3:$E$3,1))+'Loan - Grade & Staple & Leaf'!O18))","v":68.300000000000011},{"$f":"IF(LEN(E18)=0,\"data needed\",INDEX('Loan - Strength'!$C$1:$C$18,MATCH(E18,'Loan - Strength'!$A$1:$A$18,1)))","v":0},{"$f":"IF(LEN(F18)=0,\"data needed\",INDEX('Loan - Micronaire'!$C$1:$C$20,MATCH($F18,'Loan - Micronaire'!$A$1:$A$20,1)))","v":-920},-715,-1635,51.95000000000001,null,{"$f":"IF(G18=1,'Loan - Extraneous'!$B$3,IF(G18=2,'Loan - Extraneous'!$C$3,0))","v":0},{"$f":"IF(H18=1,'Loan - Extraneous'!$B$4,IF(H18=2,'Loan - Extraneous'!$C$4,0))","v":-715}]
["Variety 5",1,5,1.45,39,3.2,1,2,46,{"$f":"IF(OR(LEN(B19)=0,LEN(C19)=0,LEN(D19)=0),\"data needed\",IF(I19<44,\"staple too short for ELS loan\",INDEX('Loan - Grade & Staple & Leaf'!$A$1:$E$10,MATCH($B19,'Loan - Grade & Staple & Leaf'!$B$1:$B$10,0),MATCH($I19,'Loan - Grade & Staple & Leaf'!$A$3:$E$3,1))+'Loan - Grade & Staple & Leaf'!O19))","v":77.45},{"$f":"IF(LEN(E19)=0,\"data needed\",INDEX('Loan - Strength'!$C$1:$C$18,MATCH(E19,'Loan - Strength'!$A$1:$A$18,1)))","v":0},{"$f":"IF(LEN(F19)=0,\"data needed\",INDEX('Loan - Micronaire'!$C$1:$C$20,MATCH($F19,'Loan - Micronaire'!$A$1:$A$20,1)))","v":-920},-1845,-2765,49.800000000000004,null,{"$f":"IF(G19=1,'Loan - Extraneous'!$B$3,IF(G19=2,'Loan - Extraneous'!$C$3,0))","v":-810},{"$f":"IF(H19=1,'Loan - Extraneous'!$B$4,IF(H19=2,'Loan - Extraneous'!$C$4,0))","v":-1035}]
["Variety 6",2,6,1.45,36.700000000000003,3.4,2,0,46,{"$f":"IF(OR(LEN(B20)=0,LEN(C20)=0,LEN(D20)=0),\"data needed\",IF(I20<44,\"staple too short for ELS loan\",INDEX('Loan - Grade & Staple & Leaf'!$A$1:$E$10,MATCH($B20,'Loan - Grade & Staple & Leaf'!$B$1:$B$10,0),MATCH($I20,'Loan - Grade & Staple & Leaf'!$A$3:$E$3,1))+'Loan - Grade & Staple & Leaf'!O20))","v":77.05},{"$f":"IF(LEN(E20)=0,\"data needed\",INDEX('Loan - Strength'!$C$1:$C$18,MATCH(E20,'Loan - Strength'!$A$1:$A$18,1)))","v":-850},{"$f":"IF(LEN(F20)=0,\"data needed\",INDEX('Loan - Micronaire'!$C$1:$C$20,MATCH($F20,'Loan - Micronaire'!$A$1:$A$20,1)))","v":-415},-1095,-2360,53.449999999999996,null,{"$f":"IF(G20=1,'Loan - Extraneous'!$B$3,IF(G20=2,'Loan - Extraneous'!$C$3,0))","v":-1095},{"$f":"IF(H20=1,'Loan - Extraneous'!$B$4,IF(H20=2,'Loan - Extraneous'!$C$4,0))","v":0}]
{"$rows_left_out":5}
{"sheet":"Yield and Turnout Data","index":3,"n_rows":500,"n_cols":10,"rows_kept":500,"cut":false,"hidden":false,"merged":[]}
["Enter Yield and Turnout Data for Each Sample"]
["Enter yield and turnout data in columns B & C."]
[]
[null,null,null,null,"Note: Seed yield is the product of lint yield and estimated pounds of seed per pound of lint entered on the Base Values sheet."]
[]
[]
[null,null,"Note: Click the Refresh button to update/extend formulas in columns E-J to all rows with data."]
[]
[]
[]
[null,null,null,null,"Estimated",null,null,"Picking"]
[null,"Lint",null,"Lint","Seed","Seed","Gross","& Moduling","Ginning","Net"]
[null,"Yield","Turnout","Value","Yield","Value","Return","Cost","Cost","Return"]
["Variety/Sample Name","(lbs/Acre)","(%)","($/Acre)","(lbs/Acre)","($/Acre)","($/Acre)","($/Acre)","($/Acre)","($/Acre)"]
[{"$f":"IF(LEN('HVI Quality Data'!A15)>0,'HVI Quality Data'!A15,\"\")","v":"Variety 1"},615,34.5,{"$f":"IF(LEN(B15)=0,\"\",ROUND($B15*'HVI Quality Data'!O15/100,0))","v":228},{"$f":"IF(LEN(B15)=0,\"\",ROUND(B15*'Base Values'!$B$16,0))","v":868},{"$f":"IF(LEN(B15)=0,\"\",ROUND(E15/2000*'Base Values'!$B$10,0))","v":80},{"$f":"IF(LEN(B15)=0,\"\",SUM(D15,F15))","v":308},{"$f":"IF(OR(LEN(B15)=0,LEN(C15)=0),\"\",ROUND(B15/(C15/100)*'Base Values'!$B$12/100,0))","v":57},{"$f":"IF(LEN(B15)=0,\"\",ROUND(B15*'Base Values'!$B$14,0))","v":74},{"$f":"IF(OR(LEN(B15)=0,LEN(C15)=0),\"\",G15-H15-I15)","v":177}]
[{"$f":"IF(LEN('HVI Quality Data'!A16)>0,'HVI Quality Data'!A16,\"\")","v":"Variety 2"},635,34.799999999999997,{"$f":"IF(LEN(B16)=0,\"\",ROUND($B16*'HVI Quality Data'!O16/100,0))","v":180},{"$f":"IF(LEN(B16)=0,\"\",ROUND(B16*'Base Values'!$B$16,0))","v":897},{"$f":"IF(LEN(B16)=0,\"\",ROUND(E16/2000*'Base Values'!$B$10,0))","v":83},{"$f":"IF(LEN(B16)=0,\"\",SUM(D16,F16))","v":263},{"$f":"IF(OR(LEN(B16)=0,LEN(C16)=0),\"\",ROUND(B16/(C16/100)*'Base Values'!$B$12/100,0))","v":58},{"$f":"IF(LEN(B16)=0,\"\",ROUND(B16*'Base Values'!$B$14,0))","v":76},{"$f":"IF(OR(LEN(B16)=0,LEN(C16)=0),\"\",G16-H16-I16)","v":129}]
[{"$f":"IF(LEN('HVI Quality Data'!A17)>0,'HVI Quality Data'!A17,\"\")","v":"Variety 3"},655,35.299999999999997,{"$f":"IF(LEN(B17)=0,\"\",ROUND($B17*'HVI Quality Data'!O17/100,0))","v":259},{"$f":"IF(LEN(B17)=0,\"\",ROUND(B17*'Base Values'!$B$16,0))","v":925},{"$f":"IF(LEN(B17)=0,\"\",ROUND(E17/2000*'Base Values'!$B$10,0))","v":86},345,{"$f":"IF(OR(LEN(B17)=0,LEN(C17)=0),\"\",ROUND(B17/(C17/100)*'Base Values'!$B$12/100,0))","v":59},{"$f":"IF(LEN(B17)=0,\"\",ROUND(B17*'Base Values'!$B$14,0))","v":79},207]
[{"$f":"IF(LEN('HVI Quality Data'!A18)>0,'HVI Quality Data'!A18,\"\")","v":"Variety 4"},675,35.6,{"$f":"IF(LEN(B18)=0,\"\",ROUND($B18*'HVI Quality Data'!O18/100,0))","v":351},{"$f":"IF(LEN(B18)=0,\"\",ROUND(B18*'Base Values'!$B$16,0))","v":953},{"$f":"IF(LEN(B18)=0,\"\",ROUND(E18/2000*'Base Values'!$B$10,0))","v":88},439,{"$f":"IF(OR(LEN(B18)=0,LEN(C18)=0),\"\",ROUND(B18/(C18/100)*'Base Values'!$B$12/100,0))","v":61},{"$f":"IF(LEN(B18)=0,\"\",ROUND(B18*'Base Values'!$B$14,0))","v":81},297]
[{"$f":"IF(LEN('HVI Quality Data'!A19)>0,'HVI Quality Data'!A19,\"\")","v":"Variety 5"},695,35.9,{"$f":"IF(LEN(B19)=0,\"\",ROUND($B19*'HVI Quality Data'!O19/100,0))","v":346},{"$f":"IF(LEN(B19)=0,\"\",ROUND(B19*'Base Values'!$B$16,0))","v":981},{"$f":"IF(LEN(B19)=0,\"\",ROUND(E19/2000*'Base Values'!$B$10,0))","v":91},437,{"$f":"IF(OR(LEN(B19)=0,LEN(C19)=0),\"\",ROUND(B19/(C19/100)*'Base Values'!$B$12/100,0))","v":62},{"$f":"IF(LEN(B19)=0,\"\",ROUND(B19*'Base Values'!$B$14,0))","v":83},292]
[{"$f":"IF(LEN('HVI Quality Data'!A20)>0,'HVI Quality Data'!A20,\"\")","v":"Variety 6"},715,36.299999999999997,{"$f":"IF(LEN(B20)=0,\"\",ROUND($B20*'HVI Quality Data'!O20/100,0))","v":382},{"$f":"IF(LEN(B20)=0,\"\",ROUND(B20*'Base Values'!$B$16,0))","v":1010},{"$f":"IF(LEN(B20)=0,\"\",ROUND(E20/2000*'Base Values'!$B$10,0))","v":93},475,{"$f":"IF(OR(LEN(B20)=0,LEN(C20)=0),\"\",ROUND(B20/(C20/100)*'Base Values'!$B$12/100,0))","v":63},{"$f":"IF(LEN(B20)=0,\"\",ROUND(B20*'Base Values'!$B$14,0))","v":86},326]
{"$rows_left_out":481}
{"sheet":"Charts - Loan Value","index":4,"n_rows":7,"n_cols":12,"rows_kept":7,"cut":false,"hidden":false,"merged":[]}
[]
[]
[]
[]
[]
[null,null,null,null,null,null,null,null,null,null,null,{"$f":"CONCATENATE('Base Values'!$B$6,\" - Loan Values (cents/lb)\")","v":"2017/18 Sample Loan Values - Loan Values (cents/lb)"}]
[null,null,null,null,null,null,null,null,null,null,null,"cents/lb"]

{"sheet":"Charts - Net Return","index":5,"n_rows":37,"n_cols":20,"rows_kept":37,"cut":false,"hidden":false,"merged":[]}
[]
[]
[]
[]
[]
[]
[null,null,null,null,null,null,null,null,null,null,null,null,null,null,null,null,null,null,null,{"$f":"CONCATENATE('Base Values'!$B$6,\" - Loan Values (cents/lb)\")","v":"2017/18 Sample Loan Values - Loan Values (cents/lb)"}]
[null,null,null,null,null,null,null,null,null,null,null,null,null,null,null,null,null,null,null,"cents/lb"]
[]
[null,null,null,null,null,null,null,null,null,null,null,null,null,null,null,null,null,null,null,{"$f":"CONCATENATE('Base Values'!$B$6,\" - Lint Yield (lb/acre)\")","v":"2017/18 Sample Loan Values - Lint Yield (lb/acre)"}]
[null,null,null,null,null,null,null,null,null,null,null,null,null,null,null,null,null,null,null,"lb/acre"]
[]
[]
[]
[]
[]
[]
[]
[]
[]
{"$rows_left_out":18}
{"sheet":"Loan - Grade & Staple & Leaf","index":6,"n_rows":24,"n_cols":15,"rows_kept":24,"cut":false,"hidden":true,"merged":[[12,12,12,13]]}
[]
[]
[null,"Color",44,46,48,null,"Leaf","Leaf Discount","Color"]
[null,1,76.900000000000006,81.150000000000006,81.349999999999994,null,1,0,"All"]
[null,2,76.599999999999994,80.849999999999994,81.099999999999994,null,2,0,"All"]
[null,3,71.900000000000006,76.05,76.2,null,3,-3.45,"1-3"]
[null,4,56.1,60.25,60.25,null,4,-3.6,"1-3"]
[null,5,46.75,48.65,48.65,null,5,-3.7,"1-4"]
[null,6,41.8,43.15,43.15,null,6,-3.8,"1-5"]
[null,7,37,37,37,null,7,-3.8,"1-6"]
[]
[]
[null,null,null,null,null,null,null,null,null,null,null,null,"for reference"]
[null,null,null,null,null,null,null,null,null,null,null,null,"Color","Leaf","Leaf Discount"]
[null,null,null,null,null,null,null,null,null,null,null,{"$f":"'HVI Quality Data'!A15","v":"Variety 1"},{"$f":"'HVI Quality Data'!B15","v":1},{"$f":"'HVI Quality Data'!C15","v":1},{"$f":"IF('HVI Quality Data'!C15<=2,0,IF(AND('HVI Quality Data'!C15=3,'HVI Quality Data'!B15<=3),$H$6,IF(AND('HVI Quality Data'!C15=4,'HVI Quality Data'!B15<=3),$H$7,IF(AND('HVI Quality Data'!C15=5,'HVI Quality Data'!B15<=4),$H$8,IF(AND('HVI Quality Data'!C15=6,'HVI Quality Data'!B15<=5),$H$9,IF(AND('HVI Quality Data'!C15>=7,'HVI Quality Data'!B15<=6),$H$10,0))))))","v":0}]
[null,null,null,null,null,null,null,null,null,null,null,{"$f":"'HVI Quality Data'!A16","v":"Variety 2"},{"$f":"'HVI Quality Data'!B16","v":1},{"$f":"'HVI Quality Data'!C16","v":2},{"$f":"IF('HVI Quality Data'!C16<=2,0,IF(AND('HVI Quality Data'!C16=3,'HVI Quality Data'!B16<=3),$H$6,IF(AND('HVI Quality Data'!C16=4,'HVI Quality Data'!B16<=3),$H$7,IF(AND('HVI Quality Data'!C16=5,'HVI Quality Data'!B16<=4),$H$8,IF(AND('HVI Quality Data'!C16=6,'HVI Quality Data'!B16<=5),$H$9,IF(AND('HVI Quality Data'!C16>=7,'HVI Quality Data'!B16<=6),$H$10,0))))))","v":0}]
[null,null,null,null,null,null,null,null,null,null,null,{"$f":"'HVI Quality Data'!A17","v":"Variety 3"},{"$f":"'HVI Quality Data'!B17","v":2},{"$f":"'HVI Quality Data'!C17","v":3},{"$f":"IF('HVI Quality Data'!C17<=2,0,IF(AND('HVI Quality Data'!C17=3,'HVI Quality Data'!B17<=3),$H$6,IF(AND('HVI Quality Data'!C17=4,'HVI Quality Data'!B17<=3),$H$7,IF(AND('HVI Quality Data'!C17=5,'HVI Quality Data'!B17<=4),$H$8,IF(AND('HVI Quality Data'!C17=6,'HVI Quality Data'!B17<=5),$H$9,IF(AND('HVI Quality Data'!C17>=7,'HVI Quality Data'!B17<=6),$H$10,0))))))","v":-3.45}]
[null,null,null,null,null,null,null,null,null,null,null,{"$f":"'HVI Quality Data'!A18","v":"Variety 4"},{"$f":"'HVI Quality Data'!B18","v":3},{"$f":"'HVI Quality Data'!C18","v":4},{"$f":"IF('HVI Quality Data'!C18<=2,0,IF(AND('HVI Quality Data'!C18=3,'HVI Quality Data'!B18<=3),$H$6,IF(AND('HVI Quality Data'!C18=4,'HVI Quality Data'!B18<=3),$H$7,IF(AND('HVI Quality Data'!C18=5,'HVI Quality Data'!B18<=4),$H$8,IF(AND('HVI Quality Data'!C18=6,'HVI Quality Data'!B18<=5),$H$9,IF(AND('HVI Quality Data'!C18>=7,'HVI Quality Data'!B18<=6),$H$10,0))))))","v":-3.6}]
[null,null,null,null,null,null,null,null,null,null,null,{"$f":"'HVI Quality Data'!A19","v":"Variety 5"},{"$f":"'HVI Quality Data'!B19","v":1},{"$f":"'HVI Quality Data'!C19","v":5},{"$f":"IF('HVI Quality Data'!C19<=2,0,IF(AND('HVI Quality Data'!C19=3,'HVI Quality Data'!B19<=3),$H$6,IF(AND('HVI Quality Data'!C19=4,'HVI Quality Data'!B19<=3),$H$7,IF(AND('HVI Quality Data'!C19=5,'HVI Quality Data'!B19<=4),$H$8,IF(AND('HVI Quality Data'!C19=6,'HVI Quality Data'!B19<=5),$H$9,IF(AND('HVI Quality Data'!C19>=7,'HVI Quality Data'!B19<=6),$H$10,0))))))","v":-3.7}]
[null,null,null,null,null,null,null,null,null,null,null,{"$f":"'HVI Quality Data'!A20","v":"Variety 6"},{"$f":"'HVI Quality Data'!B20","v":2},{"$f":"'HVI Quality Data'!C20","v":6},{"$f":"IF('HVI Quality Data'!C20<=2,0,IF(AND('HVI Quality Data'!C20=3,'HVI Quality Data'!B20<=3),$H$6,IF(AND('HVI Quality Data'!C20=4,'HVI Quality Data'!B20<=3),$H$7,IF(AND('HVI Quality Data'!C20=5,'HVI Quality Data'!B20<=4),$H$8,IF(AND('HVI Quality Data'!C20=6,'HVI Quality Data'!B20<=5),$H$9,IF(AND('HVI Quality Data'!C20>=7,'HVI Quality Data'!B20<=6),$H$10,0))))))","v":-3.8}]
{"$rows_left_out":5}
{"sheet":"Loan - Strength","index":7,"n_rows":7,"n_cols":3,"rows_kept":7,"cut":false,"hidden":true,"merged":[]}
["Strength"]
["Lower","Upper","Points"]
[0,35.299999999999997,-1350]
[35.4,35.5,-1350]
[35.5,36.4,-1100]
[36.5,37.4,-850]
[37.5,200,0]

{"sheet":"Loan - Micronaire","index":8,"n_rows":8,"n_cols":3,"rows_kept":8,"cut":false,"hidden":true,"merged":[]}
["Micronaire"]
["Lower","Upper","Points"]
[0,2.5,-1915]
[2.6,2.7,-1915]
[2.7,2.9,-1420]
[3,3.2,-920]
[3.3,3.4,-415]
[3.5,200,0]

{"sheet":"Loan - Extraneous","index":9,"n_rows":4,"n_cols":3,"rows_kept":4,"cut":false,"hidden":true,"merged":[]}
["Extraneous Matter"]
[null,"Level 1","Level 2"]
["Prep All Locations",-810,-1095]
["Other",-715,-1035]