{"text_format":"1","workbook":"xlsx","n_sheets":10,"sheets":["Main Menu","Base Values","HVI Quality Data","Yield and Turnout Data","Charts - Loan Value","Charts - Net Return","Loan - Grade & Staple & Leaf","Loan - Strength","Loan - Micronaire","Loan - Extraneous"],"not_rendered":{"charts":5,"images":1,"macros":1,"external_links":1,"defined_names":4,"comments":2,"pivot_tables":0},"unopened":[],"bounds":{"document_bytes":16777216,"sheet_cells":100000,"rows_first":2000,"rows_last":500,"rows_between":2000,"halvings":0,"cell_chars":16384,"cell_head_chars":4096},"cells_cut":0,"cells_raw":0,"read":"whole","date_system":"1900"}

{"sheet":"Main Menu","index":0,"n_rows":23,"n_cols":2,"rows_kept":23,"cut":false,"hidden":false,"merged":[]}
[]
[]
[]
[]
[]
[]
[]
[]
[]
[]
[]
[]
[]
[]
[]
[]
[]
[]
[]
[]
[]
[null,"Developed by Dr. Lawrence Falconer, Mississippi State Extension and Jeanne Reeves, Cotton Incorporated."]
[null,"2017 update by Cotton Incorporated."]

{"sheet":"Base Values","index":1,"n_rows":16,"n_cols":3,"rows_kept":16,"cut":false,"hidden":false,"merged":[]}
[]
[]
[]
[]
[null,"Base Values","Value Units"]
["Study/Test Title (used in report & chart titles produced through this program)","2017/18 Sample Loan Values","n/a"]
[]
["Base quality price ",79.77,"cents/lb"]
[]
["Cottonseed Value (USD/ton)",185,"USD/ton"]
[]
["Picking/Stripping & Moduling Cost per Cwt of Seed Cotton",3.2,"USD/acre"]
[]
["Ginning Cost per Pound of Lint",0.12,"USD/lb"]
[]
["Pounds of Seed per Pound of Lint",1.4119999999999999,"lb of seed/lb of lint"]

{"sheet":"HVI Quality Data","index":2,"n_rows":24,"n_cols":18,"rows_kept":24,"cut":false,"hidden":false,"merged":[[12,6,12,7]]}
["Enter HVI Quality Data for Each Sample"]
["Enter HVI data in columns A to H."]
[null,null,null,null,null,null,null,"Note: Staple lengths below 44 (1.375\") not eligible for ELS loan."]
[null,null,null,null,null,null,null,"Note: There are no premiums/discounts for uniformity for ELS."]
[null,null,null,null,null,null,null,"Note: Extraneous matter readings are 0, 1, or 2.  Blank cells for extraneous matter are treated as 0."]
[null,null,null,null,null,null,null,"link to USDA loan tables"]
[]
[null,null,"Note: Click the Refresh button to update/extend formulas in columns I-O to all rows with data."]
[]
[null,null,null,null,null,null,null,null,null,"Loan Rate"]
[null,null,null,null,null,null,null,null,null,"Based on","Strength","Mike",null,"Net","Net"]
[null,null,null,null,null,null,null,null,null,"Staple,","Premium","Premium","Extraneous","Premium","Loan"]
[null,null,null,null,null,null,"Extraneous Matter",null,null,"Color, &","or","or","Matter","or","Price"]
["Variety/Sample Name","Color","Leaf","Length (inches)","Strength","Mike","Preparation","Other","Staple (32nds)","Leaf","Discount","Discount","Discount","Discount","(cents/lb)",null,"Prep All Locations","Other"]
["Variety 1",1,1,1.375,35.4,2.4,0,1,{"$f":"IF(LEN(D15)=0,\"data needed\",ROUND(D15*32,0))","v":44},{"$f":"IF(OR(LEN(B15)=0,LEN(C15)=0,LEN(D15)=0),\"data needed\",IF(I15<44,\"staple too short for ELS loan\",INDEX('Loan - Grade & Staple & Leaf'!$A$1:$E$10,MATCH($B15,'Loan - Grade & Staple & Leaf'!$B$1:$B$10,0),MATCH($I15,'Loan - Grade & Staple & Leaf'!$A$3:$E$3,1))+'Loan - Grade & Staple & Leaf'!O15))","v":76.900000000000006},{"$f":"IF(LEN(E15)=0,\"data needed\",INDEX('Loan - Strength'!$C$1:$C$18,MATCH(E15,'Loan - Strength'!$A$1:$A$18,1)))","v":-1350},{"$f":"IF(LEN(F15)=0,\"data needed\",INDEX('Loan - Micronaire'!$C$1:$C$20,MATCH($F15,'Loan - Micronaire'!$A$1:$A$20,1)))","v":-1915},{"$f":"SUM(Q15:R15)","v":-715},{"$f":"IF(OR(LEN(B15)=0,LEN(C15)=0,LEN(D15)=0,LEN(E15)=0,LEN(F15)=0),\"data needed\",SUM(K15:M15))","v":-3980},{"$f":"IF(OR(LEN(B15)=0,LEN(C15)=0,LEN(D15)=0,LEN(E15)=0,LEN(F15)=0),\"data needed\",IF(J15+N15/100<0,0,J15+N15/100))","v":37.100000000000009},null,{"$f":"IF(G15=1,'Loan - Extraneous'!$B$3,IF(G15=2,'Loan - Extraneous'!$C$3,0))","v":0},{"$f":"IF(H15=1,'Loan - Extraneous'!$B$4,IF(H15=2,'Loan - Extraneous'!$C$4,0))","v":-715}]
["Variety 2",1,2,1.375,36.4,2.6,1,2,{"$f":"IF(LEN(D16)=0,\"data needed\",ROUND(D16*32,0))","v":44},{"$f":"IF(OR(LEN(B16)=0,LEN(C16)=0,LEN(D16)=0),\"data needed\",IF(I16<44,\"staple too short for ELS loan\",INDEX('Loan - Grade & Staple & Leaf'!$A$1:$E$10,MATCH($B16,'Loan - Grade & Staple & Leaf'!$B$1:$B$10,0),MATCH($I16,'Loan - Grade & Staple & Leaf'!$A$3:$E$3,1))+'Loan - Grade & Staple & Leaf'!O16))","v":76.900000000000006},{"$f":"IF(LEN(E16)=0,\"data needed\",INDEX('Loan - Strength'!$C$1:$C$18,MATCH(E16,'Loan - Strength'!$A$1:$A$18,1)))","v":-1100},{"$f":"IF(LEN(F16)=0,\"data needed\",INDEX('Loan - Micronaire'!$C$1:$C$20,MATCH($F16,'Loan - Micronaire'!$A$1:$A$20,1)))","v":-1915},{"$f":"SUM(Q16:R16)","v":-1845},{"$f":"IF(OR(LEN(B16)=0,LEN(C16)=0,LEN(D16)=0,LEN(E16)=0,LEN(F16)=0),\"data needed\",SUM(K16:M16))","v":-4860},{"$f":"IF(OR(LEN(B16)=0,LEN(C16)=0,LEN(D16)=0,LEN(E16)=0,LEN(F16)=0),\"data needed\",IF(J16+N16/100<0,0,J16+N16/100))","v":28.300000000000004},null,{"$f":"IF(G16=1,'Loan - Extraneous'!$B$3,IF(G16=2,'Loan - Extraneous'!$C$3,0))","v":-810},{"$f":"IF(H16=1,'Loan - Extraneous'!$B$4,IF(H16=2,'Loan - Extraneous'!$C$4,0))","v":-1035}]
["Variety 3",2,3,1.4,37.4,2.8,2,0,45,{"$f":"IF(OR(LEN(B17)=0,LEN(C17)=0,LEN(D17)=0),\"data needed\",IF(I17<44,\"staple too short for ELS loan\",INDEX('Loan - Grade & Staple & Leaf'!$A$1:$E$10,MATCH($B17,'Loan - Grade & Staple & Leaf'!$B$1:$B$10,0),MATCH($I17,'Loan - Grade & Staple & Leaf'!$A$3:$E$3,1))+'Loan - Grade & Staple & Leaf'!O17))","v":73.149999999999991},{"$f":"IF(LEN(E17)=0,\"data needed\",INDEX('Loan - Strength'!$C$1:$C$18,MATCH(E17,'Loan - Strength'!$A$1:$A$18,1)))","v":-850},{"$f":"IF(LEN(F17)=0,\"data needed\",INDEX('Loan - Micronaire'!$C$1:$C$20,MATCH($F17,'Loan - Micronaire'!$A$1:$A$20,1)))","v":-1420},-1095,-3365,39.499999999999993,null,{"$f":"IF(G17=1,'Loan - Extraneous'!$B$3,IF(G17=2,'Loan - Extraneous'!$C$3,0))","v":-1095},{"$f":"IF(H17=1,'Loan - Extraneous'!$B$4,IF(H17=2,'Loan - Extraneous'!$C$4,0))","v":0}]
["Variety 4",3,4,1.4,38.4,3.05,0,1,45,{"$f":"IF(OR(LEN(B18)=0,LEN(C18)=0,LEN(D18)=0),\"data needed\",IF(I18<44,\"staple too short for ELS loan\",INDEX('Loan - Grade & Staple & Leaf'!$A$1:$E$10,MATCH($B18,'Loan - Grade & Staple & Leaf'!$B$1:$B$10,0),MATCH($I18,'Loan - Grade & Staple & Leaf'!$A$3:$E$3,1))+'Loan - Grade & Staple & Leaf'!O18))","v":68.300000000000011},{"$f":"IF(LEN(E18)=0,\"data needed\",INDEX('Loan - Strength'!$C$1:$C$18,MATCH(E18,'Loan - Strength'!$A$1:$A$18,1)))","v":0},{"$f":"IF(LEN(F18)=0,\"data needed\",INDEX('Loan - Micronaire'!$C$1:$C$20,MATCH($F18,'Loan - Micronaire'!$A$1:$A$20,1)))","v":-920},-715,-1635,51.95000000000001,null,{"$f":"IF(G18=1,'Loan - Extraneous'!$B$3,IF(G18=2,'Loan - Extraneous'!$C$3,0))","v":0},{"$f":"IF(H18=1,'Loan - Extraneous'!$B$4,IF(H18=2,'Loan - Extraneous'!$C$4,0))","v":-715}]
["Variety 5",1,5,1.45,39,3.2,1,2,46,{"$f":"IF(OR(LEN(B19)=0,LEN(C19)=0,LEN(D19)=0),\"data needed\",IF(I19<44,\"staple too short for ELS loan\",INDEX('Loan - Grade & Staple & Leaf'!$A$1:$E$10,MATCH($B19,'Loan - Grade & Staple & Leaf'!$B$1:$B$10,0),MATCH($I19,'Loan - Grade & Staple & Leaf'!$A$3:$E$3,1))+'Loan - Grade & Staple & Leaf'!O19))","v":77.45},{"$f":"IF(LEN(E19)=0,\"data needed\",INDEX('Loan - Strength'!$C$1:$C$18,MATCH(E19,'Loan - Strength'!$A$1:$A$18,1)))","v":0},{"$f":"IF(LEN(F19)=0,\"data needed\",INDEX('Loan - Micronaire'!$C$1:$C$20,MATCH($F19,'Loan - Micronaire'!$A$1:$A$20,1)))","v":-920},-1845,-2765,49.800000000000004,null,{"$f":"IF(G19=1,'Loan - Extraneous'!$B$3,IF(G19=2,'Loan - Extraneous'!$C$3,0))","v":-810},{"$f":"IF(H19=1,'Loan - Extraneous'!$B$4,IF(H19=2,'Loan - Extraneous'!$C$4,0))","v":-1035}]
["Variety 6",2,6,1.45,36.700000000000003,3.4,2,0,46,{"$f":"IF(OR(LEN(B20)=0,LEN(C20)=0,LEN(D20)=0),\"data needed\",IF(I20<44,\"staple too short for ELS loan\",INDEX('Loan - Grade & Staple & Leaf'!$A$1:$E$10,MATCH($B20,'Loan - Grade & Staple & Leaf'!$B$1:$B$10,0),MATCH($I20,'Loan - Grade & Staple & Leaf'!$A$3:$E$3,1))+'Loan - Grade & Staple & Leaf'!O20))","v":77.05},{"$f":"IF(LEN(E20)=0,\"data needed\",INDEX('Loan - Strength'!$C$1:$C$18,MATCH(E20,'Loan - Strength'!$A$1:$A$18,1)))","v":-850},{"$f":"IF(LEN(F20)=0,\"data needed\",INDEX('Loan - Micronaire'!$C$1:$C$20,MATCH($F20,'Loan - Micronaire'!$A$1:$A$20,1)))","v":-415},-1095,-2360,53.449999999999996,null,{"$f":"IF(G20=1,'Loan - Extraneous'!$B$3,IF(G20=2,'Loan - Extraneous'!$C$3,0))","v":-1095},{"$f":"IF(H20=1,'Loan - Extraneous'!$B$4,IF(H20=2,'Loan - Extraneous'!$C$4,0))","v":0}]
["Variety 7",3,7,1.5,37.700000000000003,3.6,0,1,48,{"$f":"IF(OR(LEN(B21)=0,LEN(C21)=0,LEN(D21)=0),\"data needed\",IF(I21<44,\"staple too short for ELS loan\",INDEX('Loan - Grade & Staple & Leaf'!$A$1:$E$10,MATCH($B21,'Loan - Grade & Staple & Leaf'!$B$1:$B$10,0),MATCH($I21,'Loan - Grade & Staple & Leaf'!$A$3:$E$3,1))+'Loan - Grade & Staple & Leaf'!O21))","v":72.400000000000006},{"$f":"IF(LEN(E21)=0,\"data needed\",INDEX('Loan - Strength'!$C$1:$C$18,MATCH(E21,'Loan - Strength'!$A$1:$A$18,1)))","v":0},{"$f":"IF(LEN(F21)=0,\"data needed\",INDEX('Loan - Micronaire'!$C$1:$C$20,MATCH($F21,'Loan - Micronaire'!$A$1:$A$20,1)))","v":0},-715,-715,65.25,null,{"$f":"IF(G21=1,'Loan - Extraneous'!$B$3,IF(G21=2,'Loan - Extraneous'!$C$3,0))","v":0},{"$f":"IF(H21=1,'Loan - Extraneous'!$B$4,IF(H21=2,'Loan - Extraneous'!$C$4,0))","v":-715}]
["Variety 8",1,1,1.5,38.700000000000003,3.8,1,2,48,{"$f":"IF(OR(LEN(B22)=0,LEN(C22)=0,LEN(D22)=0),\"data needed\",IF(I22<44,\"staple too short for ELS loan\",INDEX('Loan - Grade & Staple & Leaf'!$A$1:$E$10,MATCH($B22,'Loan - Grade & Staple & Leaf'!$B$1:$B$10,0),MATCH($I22,'Loan - Grade & Staple & Leaf'!$A$3:$E$3,1))+'Loan - Grade & Staple & Leaf'!O22))","v":81.349999999999994},{"$f":"IF(LEN(E22)=0,\"data needed\",INDEX('Loan - Strength'!$C$1:$C$18,MATCH(E22,'Loan - Strength'!$A$1:$A$18,1)))","v":0},{"$f":"IF(LEN(F22)=0,\"data needed\",INDEX('Loan - Micronaire'!$C$1:$C$20,MATCH($F22,'Loan - Micronaire'!$A$1:$A$20,1)))","v":0},-1845,-1845,62.899999999999991,null,{"$f":"IF(G22=1,'Loan - Extraneous'!$B$3,IF(G22=2,'Loan - Extraneous'!$C$3,0))","v":-810},{"$f":"IF(H22=1,'Loan - Extraneous'!$B$4,IF(H22=2,'Loan - Extraneous'!$C$4,0))","v":-1035}]
["Variety 9",2,2,1.55,39.700000000000003,4.05,2,0,50,{"$f":"IF(OR(LEN(B23)=0,LEN(C23)=0,LEN(D23)=0),\"data needed\",IF(I23<44,\"staple too short for ELS loan\",INDEX('Loan - Grade & Staple & Leaf'!$A$1:$E$10,MATCH($B23,'Loan - Grade & Staple & Leaf'!$B$1:$B$10,0),MATCH($I23,'Loan - Grade & Staple & Leaf'!$A$3:$E$3,1))+'Loan - Grade & Staple & Leaf'!O23))","v":81.099999999999994},{"$f":"IF(LEN(E23)=0,\"data needed\",INDEX('Loan - Strength'!$C$1:$C$18,MATCH(E23,'Loan - Strength'!$A$1:$A$18,1)))","v":0},{"$f":"IF(LEN(F23)=0,\"data needed\",INDEX('Loan - Micronaire'!$C$1:$C$20,MATCH($F23,'Loan - Micronaire'!$A$1:$A$20,1)))","v":0},-1095,-1095,70.149999999999991,null,{"$f":"IF(G23=1,'Loan - Extraneous'!$B$3,IF(G23=2,'Loan - Extraneous'!$C$3,0))","v":-1095},{"$f":"IF(H23=1,'Loan - Extraneous'!$B$4,IF(H23=2,'Loan - Extraneous'!$C$4,0))","v":0}]
["Variety 10",3,3,1.55,36.1,4.2,0,0,50,{"$f":"IF(OR(LEN(B24)=0,LEN(C24)=0,LEN(D24)=0),\"data needed\",IF(I24<44,\"staple too short for ELS loan\",INDEX('Loan - Grade & Staple & Leaf'!$A$1:$E$10,MATCH($B24,'Loan - Grade & Staple & Leaf'!$B$1:$B$10,0),MATCH($I24,'Loan - Grade & Staple & Leaf'!$A$3:$E$3,1))+'Loan - Grade & Staple & Leaf'!O24))","v":72.75},{"$f":"IF(LEN(E24)=0,\"data needed\",INDEX('Loan - Strength'!$C$1:$C$18,MATCH(E24,'Loan - Strength'!$A$1:$A$18,1)))","v":-1100},{"$f":"IF(LEN(F24)=0,\"data needed\",INDEX('Loan - Micronaire'!$C$1:$C$20,MATCH($F24,'Loan - Micronaire'!$A$1:$A$20,1)))","v":0},0,-1100,61.75,null,{"$f":"IF(G24=1,'Loan - Extraneous'!$B$3,IF(G24=2,'Loan - Extraneous'!$C$3,0))","v":0},{"$f":"IF(H24=1,'Loan - Extraneous'!$B$4,IF(H24=2,'Loan - Extraneous'!$C$4,0))","v":0}]

{"sheet":"Yield and Turnout Data","index":3,"n_rows":500,"n_cols":10,"rows_kept":500,"cut":false,"hidden":false,"merged":[]}
["Enter Yield and Turnout Data for Each Sample"]
["Enter yield and turnout data in columns B & C."]
[]
[null,null,null,null,"Note: Seed yield is the product of lint yield and estimated pounds of seed per pound of lint entered on the Base Values sheet."]
[]
[]
[null,null,"Note: Click the Refresh button to update/extend formulas in columns E-J to all rows with data."]
[]
[]
[]
[null,null,null,null,"Estimated",null,null,"Picking"]
[null,"Lint",null,"Lint","Seed","Seed","Gross","& Moduling","Ginning","Net"]
[null,"Yield","Turnout","Value","Yield","Value","Return","Cost","Cost","Return"]
["Variety/Sample Name","(lbs/Acre)","(%)","($/Acre)","(lbs/Acre)","($/Acre)","($/Acre)","($/Acre)","($/Acre)","($/Acre)"]
[{"$f":"IF(LEN('HVI Quality Data'!A15)>0,'HVI Quality Data'!A15,\"\")","v":"Variety 1"},615,34.5,{"$f":"IF(LEN(B15)=0,\"\",ROUND($B15*'HVI Quality Data'!O15/100,0))","v":228},{"$f":"IF(LEN(B15)=0,\"\",ROUND(B15*'Base Values'!$B$16,0))","v":868},{"$f":"IF(LEN(B15)=0,\"\",ROUND(E15/2000*'Base Values'!$B$10,0))","v":80},{"$f":"IF(LEN(B15)=0,\"\",SUM(D15,F15))","v":308},{"$f":"IF(OR(LEN(B15)=0,LEN(C15)=0),\"\",ROUND(B15/(C15/100)*'Base Values'!$B$12/100,0))","v":57},{"$f":"IF(LEN(B15)=0,\"\",ROUND(B15*'Base Values'!$B$14,0))","v":74},{"$f":"IF(OR(LEN(B15)=0,LEN(C15)=0),\"\",G15-H15-I15)","v":177}]
[{"$f":"IF(LEN('HVI Quality Data'!A16)>0,'HVI Quality Data'!A16,\"\")","v":"Variety 2"},635,34.799999999999997,{"$f":"IF(LEN(B16)=0,\"\",ROUND($B16*'HVI Quality Data'!O16/100,0))","v":180},{"$f":"IF(LEN(B16)=0,\"\",ROUND(B16*'Base Values'!$B$16,0))","v":897},{"$f":"IF(LEN(B16)=0,\"\",ROUND(E16/2000*'Base Values'!$B$10,0))","v":83},{"$f":"IF(LEN(B16)=0,\"\",SUM(D16,F16))","v":263},{"$f":"IF(OR(LEN(B16)=0,LEN(C16)=0),\"\",ROUND(B16/(C16/100)*'Base Values'!$B$12/100,0))","v":58},{"$f":"IF(LEN(B16)=0,\"\",ROUND(B16*'Base Values'!$B$14,0))","v":76},{"$f":"IF(OR(LEN(B16)=0,LEN(C16)=0),\"\",G16-H16-I16)","v":129}]
[{"$f":"IF(LEN('HVI Quality Data'!A17)>0,'HVI Quality Data'!A17,\"\")","v":"Variety 3"},655,35.299999999999997,{"$f":"IF(LEN(B17)=0,\"\",ROUND($B17*'HVI Quality Data'!O17/100,0))","v":259},{"$f":"IF(LEN(B17)=0,\"\",ROUND(B17*'Base Values'!$B$16,0))","v":925},{"$f":"IF(LEN(B17)=0,\"\",ROUND(E17/2000*'Base Values'!$B$10,0))","v":86},345,{"$f":"IF(OR(LEN(B17)=0,LEN(C17)=0),\"\",ROUND(B17/(C17/100)*'Base Values'!$B$12/100,0))","v":59},{"$f":"IF(LEN(B17)=0,\"\",ROUND(B17*'Base Values'!$B$14,0))","v":79},207]
[{"$f":"IF(LEN('HVI Quality Data'!A18)>0,'HVI Quality Data'!A18,\"\")","v":"Variety 4"},675,35.6,{"$f":"IF(LEN(B18)=0,\"\",ROUND($B18*'HVI Quality Data'!O18/100,0))","v":351},{"$f":"IF(LEN(B18)=0,\"\",ROUND(B18*'Base Values'!$B$16,0))","v":953},{"$f":"IF(LEN(B18)=0,\"\",ROUND(E18/2000*'Base Values'!$B$10,0))","v":88},439,{"$f":"IF(OR(LEN(B18)=0,LEN(C18)=0),\"\",ROUND(B18/(C18/100)*'Base Values'!$B$12/100,0))","v":61},{"$f":"IF(LEN(B18)=0,\"\",ROUND(B18*'Base Values'!$B$14,0))","v":81},297]
[{"$f":"IF(LEN('HVI Quality Data'!A19)>0,'HVI Quality Data'!A19,\"\")","v":"Variety 5"},695,35.9,{"$f":"IF(LEN(B19)=0,\"\",ROUND($B19*'HVI Quality Data'!O19/100,0))","v":346},{"$f":"IF(LEN(B19)=0,\"\",ROUND(B19*'Base Values'!$B$16,0))","v":981},{"$f":"IF(LEN(B19)=0,\"\",ROUND(E19/2000*'Base Values'!$B$10,0))","v":91},437,{"$f":"IF(OR(LEN(B19)=0,LEN(C19)=0),\"\",ROUND(B19/(C19/100)*'Base Values'!$B$12/100,0))","v":62},{"$f":"IF(LEN(B19)=0,\"\",ROUND(B19*'Base Values'!$B$14,0))","v":83},292]
[{"$f":"IF(LEN('HVI Quality Data'!A20)>0,'HVI Quality Data'!A20,\"\")","v":"Variety 6"},715,36.299999999999997,{"$f":"IF(LEN(B20)=0,\"\",ROUND($B20*'HVI Quality Data'!O20/100,0))","v":382},{"$f":"IF(LEN(B20)=0,\"\",ROUND(B20*'Base Values'!$B$16,0))","v":1010},{"$f":"IF(LEN(B20)=0,\"\",ROUND(E20/2000*'Base Values'!$B$10,0))","v":93},475,{"$f":"IF(OR(LEN(B20)=0,LEN(C20)=0),\"\",ROUND(B20/(C20/100)*'Base Values'!$B$12/100,0))","v":63},{"$f":"IF(LEN(B20)=0,\"\",ROUND(B20*'Base Values'!$B$14,0))","v":86},326]
[{"$f":"IF(LEN('HVI Quality Data'!A21)>0,'HVI Quality Data'!A21,\"\")","v":"Variety 7"},735,36.5,{"$f":"IF(LEN(B21)=0,\"\",ROUND($B21*'HVI Quality Data'!O21/100,0))","v":480},{"$f":"IF(LEN(B21)=0,\"\",ROUND(B21*'Base Values'!$B$16,0))","v":1038},{"$f":"IF(LEN(B21)=0,\"\",ROUND(E21/2000*'Base Values'!$B$10,0))","v":96},576,{"$f":"IF(OR(LEN(B21)=0,LEN(C21)=0),\"\",ROUND(B21/(C21/100)*'Base Values'!$B$12/100,0))","v":64},{"$f":"IF(LEN(B21)=0,\"\",ROUND(B21*'Base Values'!$B$14,0))","v":88},424]
[{"$f":"IF(LEN('HVI Quality Data'!A22)>0,'HVI Quality Data'!A22,\"\")","v":"Variety 8"},755,36.700000000000003,{"$f":"IF(LEN(B22)=0,\"\",ROUND($B22*'HVI Quality Data'!O22/100,0))","v":475},{"$f":"IF(LEN(B22)=0,\"\",ROUND(B22*'Base Values'!$B$16,0))","v":1066},{"$f":"IF(LEN(B22)=0,\"\",ROUND(E22/2000*'Base Values'!$B$10,0))","v":99},574,{"$f":"IF(OR(LEN(B22)=0,LEN(C22)=0),\"\",ROUND(B22/(C22/100)*'Base Values'!$B$12/100,0))","v":66},{"$f":"IF(LEN(B22)=0,\"\",ROUND(B22*'Base Values'!$B$14,0))","v":91},417]
[{"$f":"IF(LEN('HVI Quality Data'!A23)>0,'HVI Quality Data'!A23,\"\")","v":"Variety 9"},775,36.9,{"$f":"IF(LEN(B23)=0,\"\",ROUND($B23*'HVI Quality Data'!O23/100,0))","v":544},{"$f":"IF(LEN(B23)=0,\"\",ROUND(B23*'Base Values'!$B$16,0))","v":1094},{"$f":"IF(LEN(B23)=0,\"\",ROUND(E23/2000*'Base Values'!$B$10,0))","v":101},645,{"$f":"IF(OR(LEN(B23)=0,LEN(C23)=0),\"\",ROUND(B23/(C23/100)*'Base Values'!$B$12/100,0))","v":67},{"$f":"IF(LEN(B23)=0,\"\",ROUND(B23*'Base Values'!$B$14,0))","v":93},485]
[{"$f":"IF(LEN('HVI Quality Data'!A24)>0,'HVI Quality Data'!A24,\"\")","v":"Variety 10"},795,37.1,{"$f":"IF(LEN(B24)=0,\"\",ROUND($B24*'HVI Quality Data'!O24/100,0))","v":491},{"$f":"IF(LEN(B24)=0,\"\",ROUND(B24*'Base Values'!$B$16,0))","v":1123},{"$f":"IF(LEN(B24)=0,\"\",ROUND(E24/2000*'Base Values'!$B$10,0))","v":104},595,{"$f":"IF(OR(LEN(B24)=0,LEN(C24)=0),\"\",ROUND(B24/(C24/100)*'Base Values'!$B$12/100,0))","v":69},{"$f":"IF(LEN(B24)=0,\"\",ROUND(B24*'Base Values'!$B$14,0))","v":95},431]
[{"$f":"IF(LEN('HVI Quality Data'!A25)>0,'HVI Quality Data'!A25,\"\")","v":""},null,null,{"$f":"IF(LEN(B25)=0,\"\",ROUND($B25*'HVI Quality Data'!O25/100,0))","v":""},{"$f":"IF(LEN(B25)=0,\"\",ROUND(B25*'Base Values'!$B$16,0))","v":""},{"$f":"IF(LEN(B25)=0,\"\",ROUND(E25/2000*'Base Values'!$B$10,0))","v":""},{"$f":"IF(LEN(B25)=0,\"\",SUM(D25,F25))","v":""},{"$f":"IF(OR(LEN(B25)=0,LEN(C25)=0),\"\",ROUND(B25/(C25/100)*'Base Values'!$B$12/100,0))","v":""},{"$f":"IF(LEN(B25)=0,\"\",ROUND(B25*'Base Values'!$B$14,0))","v":""},{"$f":"IF(OR(LEN(B25)=0,LEN(C25)=0),\"\",G25-H25-I25)","v":""}]
[{"$f":"IF(LEN('HVI Quality Data'!A26)>0,'HVI Quality Data'!A26,\"\")","v":""},null,null,{"$f":"IF(LEN(B26)=0,\"\",ROUND($B26*'HVI Quality Data'!O26/100,0))","v":""},{"$f":"IF(LEN(B26)=0,\"\",ROUND(B26*'Base Values'!$B$16,0))","v":""},{"$f":"IF(LEN(B26)=0,\"\",ROUND(E26/2000*'Base Values'!$B$10,0))","v":""},"",{"$f":"IF(OR(LEN(B26)=0,LEN(C26)=0),\"\",ROUND(B26/(C26/100)*'Base Values'!$B$12/100,0))","v":""},{"$f":"IF(LEN(B26)=0,\"\",ROUND(B26*'Base Values'!$B$14,0))","v":""},""]
[{"$f":"IF(LEN('HVI Quality Data'!A27)>0,'HVI Quality Data'!A27,\"\")","v":""},null,null,{"$f":"IF(LEN(B27)=0,\"\",ROUND($B27*'HVI Quality Data'!O27/100,0))","v":""},{"$f":"IF(LEN(B27)=0,\"\",ROUND(B27*'Base Values'!$B$16,0))","v":""},{"$f":"IF(LEN(B27)=0,\"\",ROUND(E27/2000*'Base Values'!$B$10,0))","v":""},"",{"$f":"IF(OR(LEN(B27)=0,LEN(C27)=0),\"\",ROUND(B27/(C27/100)*'Base Values'!$B$12/100,0))","v":""},{"$f":"IF(LEN(B27)=0,\"\",ROUND(B27*'Base Values'!$B$14,0))","v":""},""]
[{"$f":"IF(LEN('HVI Quality Data'!A28)>0,'HVI Quality Data'!A28,\"\")","v":""},null,null,{"$f":"IF(LEN(B28)=0,\"\",ROUND($B28*'HVI Quality Data'!O28/100,0))","v":""},{"$f":"IF(LEN(B28)=0,\"\",ROUND(B28*'Base Values'!$B$16,0))","v":""},{"$f":"IF(LEN(B28)=0,\"\",ROUND(E28/2000*'Base Values'!$B$10,0))","v":""},"",{"$f":"IF(OR(LEN(B28)=0,LEN(C28)=0),\"\",ROUND(B28/(C28/100)*'Base Values'!$B$12/100,0))","v":""},{"$f":"IF(LEN(B28)=0,\"\",ROUND(B28*'Base Values'!$B$14,0))","v":""},""]
[{"$f":"IF(LEN('HVI Quality Data'!A29)>0,'HVI Quality Data'!A29,\"\")","v":""},null,null,{"$f":"IF(LEN(B29)=0,\"\",ROUND($B29*'HVI Quality Data'!O29/100,0))","v":""},{"$f":"IF(LEN(B29)=0,\"\",ROUND(B29*'Base Values'!$B$16,0))","v":""},{"$f":"IF(LEN(B29)=0,\"\",ROUND(E29/2000*'Base Values'!$B$10,0))","v":""},"",{"$f":"IF(OR(LEN(B29)=0,LEN(C29)=0),\"\",ROUND(B29/(C29/100)*'Base Values'!$B$12/100,0))","v":""},{"$f":"IF(LEN(B29)=0,\"\",ROUND(B29*'Base Values'!$B$14,0))","v":""},""]
[{"$f":"IF(LEN('HVI Quality Data'!A30)>0,'HVI Quality Data'!A30,\"\")","v":""},null,null,{"$f":"IF(LEN(B30)=0,\"\",ROUND($B30*'HVI Quality Data'!O30/100,0))","v":""},{"$f":"IF(LEN(B30)=0,\"\",ROUND(B30*'Base Values'!$B$16,0))","v":""},{"$f":"IF(LEN(B30)=0,\"\",ROUND(E30/2000*'Base Values'!$B$10,0))","v":""},"",{"$f":"IF(OR(LEN(B30)=0,LEN(C30)=0),\"\",ROUND(B30/(C30/100)*'Base Values'!$B$12/100,0))","v":""},{"$f":"IF(LEN(B30)=0,\"\",ROUND(B30*'Base Values'!$B$14,0))","v":""},""]
[{"$f":"IF(LEN('HVI Quality Data'!A31)>0,'HVI Quality Data'!A31,\"\")","v":""},null,null,{"$f":"IF(LEN(B31)=0,\"\",ROUND($B31*'HVI Quality Data'!O31/100,0))","v":""},{"$f":"IF(LEN(B31)=0,\"\",ROUND(B31*'Base Values'!$B$16,0))","v":""},{"$f":"IF(LEN(B31)=0,\"\",ROUND(E31/2000*'Base Values'!$B$10,0))","v":""},"",{"$f":"IF(OR(LEN(B31)=0,LEN(C31)=0),\"\",ROUND(B31/(C31/100)*'Base Values'!$B$12/100,0))","v":""},{"$f":"IF(LEN(B31)=0,\"\",ROUND(B31*'Base Values'!$B$14,0))","v":""},""]
[{"$f":"IF(LEN('HVI Quality Data'!A32)>0,'HVI Quality Data'!A32,\"\")","v":""},null,null,{"$f":"IF(LEN(B32)=0,\"\",ROUND($B32*'HVI Quality Data'!O32/100,0))","v":""},{"$f":"IF(LEN(B32)=0,\"\",ROUND(B32*'Base Values'!$B$16,0))","v":""},{"$f":"IF(LEN(B32)=0,\"\",ROUND(E32/2000*'Base Values'!$B$10,0))","v":""},"",{"$f":"IF(OR(LEN(B32)=0,LEN(C32)=0),\"\",ROUND(B32/(C32/100)*'Base Values'!$B$12/100,0))","v":""},{"$f":"IF(LEN(B32)=0,\"\",ROUND(B32*'Base Values'!$B$14,0))","v":""},""]
[{"$f":"IF(LEN('HVI Quality Data'!A33)>0,'HVI Quality Data'!A33,\"\")","v":""},null,null,{"$f":"IF(LEN(B33)=0,\"\",ROUND($B33*'HVI Quality Data'!O33/100,0))","v":""},{"$f":"IF(LEN(B33)=0,\"\",ROUND(B33*'Base Values'!$B$16,0))","v":""},{"$f":"IF(LEN(B33)=0,\"\",ROUND(E33/2000*'Base Values'!$B$10,0))","v":""},"",{"$f":"IF(OR(LEN(B33)=0,LEN(C33)=0),\"\",ROUND(B33/(C33/100)*'Base Values'!$B$12/100,0))","v":""},{"$f":"IF(LEN(B33)=0,\"\",ROUND(B33*'Base Values'!$B$14,0))","v":""},""]
[{"$f":"IF(LEN('HVI Quality Data'!A34)>0,'HVI Quality Data'!A34,\"\")","v":""},null,null,{"$f":"IF(LEN(B34)=0,\"\",ROUND($B34*'HVI Quality Data'!O34/100,0))","v":""},{"$f":"IF(LEN(B34)=0,\"\",ROUND(B34*'Base Values'!$B$16,0))","v":""},{"$f":"IF(LEN(B34)=0,\"\",ROUND(E34/2000*'Base Values'!$B$10,0))","v":""},"",{"$f":"IF(OR(LEN(B34)=0,LEN(C34)=0),\"\",ROUND(B34/(C34/100)*'Base Values'!$B$12/100,0))","v":""},{"$f":"IF(LEN(B34)=0,\"\",ROUND(B34*'Base Values'!$B$14,0))","v":""},""]
[{"$f":"IF(LEN('HVI Quality Data'!A35)>0,'HVI Quality Data'!A35,\"\")","v":""},null,null,{"$f":"IF(LEN(B35)=0,\"\",ROUND($B35*'HVI Quality Data'!O35/100,0))","v":""},{"$f":"IF(LEN(B35)=0,\"\",ROUND(B35*'Base Values'!$B$16,0))","v":""},{"$f":"IF(LEN(B35)=0,\"\",ROUND(E35/2000*'Base Values'!$B$10,0))","v":""},"",{"$f":"IF(OR(LEN(B35)=0,LEN(C35)=0),\"\",ROUND(B35/(C35/100)*'Base Values'!$B$12/100,0))","v":""},{"$f":"IF(LEN(B35)=0,\"\",ROUND(B35*'Base Values'!$B$14,0))","v":""},""]
[{"$f":"IF(LEN('HVI Quality Data'!A36)>0,'HVI Quality Data'!A36,\"\")","v":""},null,null,{"$f":"IF(LEN(B36)=0,\"\",ROUND($B36*'HVI Quality Data'!O36/100,0))","v":""},{"$f":"IF(LEN(B36)=0,\"\",ROUND(B36*'Base Values'!$B$16,0))","v":""},{"$f":"IF(LEN(B36)=0,\"\",ROUND(E36/2000*'Base Values'!$B$10,0))","v":""},"",{"$f":"IF(OR(LEN(B36)=0,LEN(C36)=0),\"\",ROUND(B36/(C36/100)*'Base Values'!$B$12/100,0))","v":""},{"$f":"IF(LEN(B36)=0,\"\",ROUND(B36*'Base Values'!$B$14,0))","v":""},""]
[{"$f":"IF(LEN('HVI Quality Data'!A37)>0,'HVI Quality Data'!A37,\"\")","v":""},null,null,{"$f":"IF(LEN(B37)=0,\"\",ROUND($B37*'HVI Quality Data'!O37/100,0))","v":""},{"$f":"IF(LEN(B37)=0,\"\",ROUND(B37*'Base Values'!$B$16,0))","v":""},{"$f":"IF(LEN(B37)=0,\"\",ROUND(E37/2000*'Base Values'!$B$10,0))","v":""},"",{"$f":"IF(OR(LEN(B37)=0,LEN(C37)=0),\"\",ROUND(B37/(C37/100)*'Base Values'!$B$12/100,0))","v":""},{"$f":"IF(LEN(B37)=0,\"\",ROUND(B37*'Base Values'!$B$14,0))","v":""},""]
[{"$f":"IF(LEN('HVI Quality Data'!A38)>0,'HVI Quality Data'!A38,\"\")","v":""},null,null,{"$f":"IF(LEN(B38)=0,\"\",ROUND($B38*'HVI Quality Data'!O38/100,0))","v":""},{"$f":"IF(LEN(B38)=0,\"\",ROUND(B38*'Base Values'!$B$16,0))","v":""},{"$f":"IF(LEN(B38)=0,\"\",ROUND(E38/2000*'Base Values'!$B$10,0))","v":""},"",{"$f":"IF(OR(LEN(B38)=0,LEN(C38)=0),\"\",ROUND(B38/(C38/100)*'Base Values'!$B$12/100,0))","v":""},{"$f":"IF(LEN(B38)=0,\"\",ROUND(B38*'Base Values'!$B$14,0))","v":""},""]
[{"$f":"IF(LEN('HVI Quality Data'!A39)>0,'HVI Quality Data'!A39,\"\")","v":""},null,null,{"$f":"IF(LEN(B39)=0,\"\",ROUND($B39*'HVI Quality Data'!O39/100,0))","v":""},{"$f":"IF(LEN(B39)=0,\"\",ROUND(B39*'Base Values'!$B$16,0))","v":""},{"$f":"IF(LEN(B39)=0,\"\",ROUND(E39/2000*'Base Values'!$B$10,0))","v":""},"",{"$f":"IF(OR(LEN(B39)=0,LEN(C39)=0),\"\",ROUND(B39/(C39/100)*'Base Values'!$B$12/100,0))","v":""},{"$f":"IF(LEN(B39)=0,\"\",ROUND(B39*'Base Values'!$B$14,0))","v":""},""]
[{"$f":"IF(LEN('HVI Quality Data'!A40)>0,'HVI Quality Data'!A40,\"\")","v":""},null,null,{"$f":"IF(LEN(B40)=0,\"\",ROUND($B40*'HVI Quality Data'!O40/100,0))","v":""},{"$f":"IF(LEN(B40)=0,\"\",ROUND(B40*'Base Values'!$B$16,0))","v":""},{"$f":"IF(LEN(B40)=0,\"\",ROUND(E40/2000*'Base Values'!$B$10,0))","v":""},"",{"$f":"IF(OR(LEN(B40)=0,LEN(C40)=0),\"\",ROUND(B40/(C40/100)*'Base Values'!$B$12/100,0))","v":""},{"$f":"IF(LEN(B40)=0,\"\",ROUND(B40*'Base Values'!$B$14,0))","v":""},""]
[{"$f":"IF(LEN('HVI Quality Data'!A41)>0,'HVI Quality Data'!A41,\"\")","v":""},null,null,{"$f":"IF(LEN(B41)=0,\"\",ROUND($B41*'HVI Quality Data'!O41/100,0))","v":""},{"$f":"IF(LEN(B41)=0,\"\",ROUND(B41*'Base Values'!$B$16,0))","v":""},{"$f":"IF(LEN(B41)=0,\"\",ROUND(E41/2000*'Base Values'!$B$10,0))","v":""},"",{"$f":"IF(OR(LEN(B41)=0,LEN(C41)=0),\"\",ROUND(B41/(C41/100)*'Base Values'!$B$12/100,0))","v":""},{"$f":"IF(LEN(B41)=0,\"\",ROUND(B41*'Base Values'!$B$14,0))","v":""},""]
[{"$f":"IF(LEN('HVI Quality Data'!A42)>0,'HVI Quality Data'!A42,\"\")","v":""},null,null,{"$f":"IF(LEN(B42)=0,\"\",ROUND($B42*'HVI Quality Data'!O42/100,0))","v":""},{"$f":"IF(LEN(B42)=0,\"\",ROUND(B42*'Base Values'!$B$16,0))","v":""},{"$f":"IF(LEN(B42)=0,\"\",ROUND(E42/2000*'Base Values'!$B$10,0))","v":""},"",{"$f":"IF(OR(LEN(B42)=0,LEN(C42)=0),\"\",ROUND(B42/(C42/100)*'Base Values'!$B$12/100,0))","v":""},{"$f":"IF(LEN(B42)=0,\"\",ROUND(B42*'Base Values'!$B$14,0))","v":""},""]
[{"$f":"IF(LEN('HVI Quality Data'!A43)>0,'HVI Quality Data'!A43,\"\")","v":""},null,null,{"$f":"IF(LEN(B43)=0,\"\",ROUND($B43*'HVI Quality Data'!O43/100,0))","v":""},{"$f":"IF(LEN(B43)=0,\"\",ROUND(B43*'Base Values'!$B$16,0))","v":""},{"$f":"IF(LEN(B43)=0,\"\",ROUND(E43/2000*'Base Values'!$B$10,0))","v":""},"",{"$f":"IF(OR(LEN(B43)=0,LEN(C43)=0),\"\",ROUND(B43/(C43/100)*'Base Values'!$B$12/100,0))","v":""},{"$f":"IF(LEN(B43)=0,\"\",ROUND(B43*'Base Values'!$B$14,0))","v":""},""]
[{"$f":"IF(LEN('HVI Quality Data'!A44)>0,'HVI Quality Data'!A44,\"\")","v":""},null,null,{"$f":"IF(LEN(B44)=0,\"\",ROUND($B44*'HVI Quality Data'!O44/100,0))","v":""},{"$f":"IF(LEN(B44)=0,\"\",ROUND(B44*'Base Values'!$B$16,0))","v":""},{"$f":"IF(LEN(B44)=0,\"\",ROUND(E44/2000*'Base Values'!$B$10,0))","v":""},"",{"$f":"IF(OR(LEN(B44)=0,LEN(C44)=0),\"\",ROUND(B44/(C44/100)*'Base Values'!$B$12/100,0))","v":""},{"$f":"IF(LEN(B44)=0,\"\",ROUND(B44*'Base Values'!$B$14,0))","v":""},""]
[{"$f":"IF(LEN('HVI Quality Data'!A45)>0,'HVI Quality Data'!A45,\"\")","v":""},null,null,{"$f":"IF(LEN(B45)=0,\"\",ROUND($B45*'HVI Quality Data'!O45/100,0))","v":""},{"$f":"IF(LEN(B45)=0,\"\",ROUND(B45*'Base Values'!$B$16,0))","v":""},{"$f":"IF(LEN(B45)=0,\"\",ROUND(E45/2000*'Base Values'!$B$10,0))","v":""},"",{"$f":"IF(OR(LEN(B45)=0,LEN(C45)=0),\"\",ROUND(B45/(C45/100)*'Base Values'!$B$12/100,0))","v":""},{"$f":"IF(LEN(B45)=0,\"\",ROUND(B45*'Base Values'!$B$14,0))","v":""},""]
[{"$f":"IF(LEN('HVI Quality Data'!A46)>0,'HVI Quality Data'!A46,\"\")","v":""},null,null,{"$f":"IF(LEN(B46)=0,\"\",ROUND($B46*'HVI Quality Data'!O46/100,0))","v":""},{"$f":"IF(LEN(B46)=0,\"\",ROUND(B46*'Base Values'!$B$16,0))","v":""},{"$f":"IF(LEN(B46)=0,\"\",ROUND(E46/2000*'Base Values'!$B$10,0))","v":""},"",{"$f":"IF(OR(LEN(B46)=0,LEN(C46)=0),\"\",ROUND(B46/(C46/100)*'Base Values'!$B$12/100,0))","v":""},{"$f":"IF(LEN(B46)=0,\"\",ROUND(B46*'Base Values'!$B$14,0))","v":""},""]
[{"$f":"IF(LEN('HVI Quality Data'!A47)>0,'HVI Quality Data'!A47,\"\")","v":""},null,null,{"$f":"IF(LEN(B47)=0,\"\",ROUND($B47*'HVI Quality Data'!O47/100,0))","v":""},{"$f":"IF(LEN(B47)=0,\"\",ROUND(B47*'Base Values'!$B$16,0))","v":""},{"$f":"IF(LEN(B47)=0,\"\",ROUND(E47/2000*'Base Values'!$B$10,0))","v":""},"",{"$f":"IF(OR(LEN(B47)=0,LEN(C47)=0),\"\",ROUND(B47/(C47/100)*'Base Values'!$B$12/100,0))","v":""},{"$f":"IF(LEN(B47)=0,\"\",ROUND(B47*'Base Values'!$B$14,0))","v":""},""]
[{"$f":"IF(LEN('HVI Quality Data'!A48)>0,'HVI Quality Data'!A48,\"\")","v":""},null,null,{"$f":"IF(LEN(B48)=0,\"\",ROUND($B48*'HVI Quality Data'!O48/100,0))","v":""},{"$f":"IF(LEN(B48)=0,\"\",ROUND(B48*'Base Values'!$B$16,0))","v":""},{"$f":"IF(LEN(B48)=0,\"\",ROUND(E48/2000*'Base Values'!$B$10,0))","v":""},"",{"$f":"IF(OR(LEN(B48)=0,LEN(C48)=0),\"\",ROUND(B48/(C48/100)*'Base Values'!$B$12/100,0))","v":""},{"$f":"IF(LEN(B48)=0,\"\",ROUND(B48*'Base Values'!$B$14,0))","v":""},""]
[{"$f":"IF(LEN('HVI Quality Data'!A49)>0,'HVI Quality Data'!A49,\"\")","v":""},null,null,{"$f":"IF(LEN(B49)=0,\"\",ROUND($B49*'HVI Quality Data'!O49/100,0))","v":""},{"$f":"IF(LEN(B49)=0,\"\",ROUND(B49*'Base Values'!$B$16,0))","v":""},{"$f":"IF(LEN(B49)=0,\"\",ROUND(E49/2000*'Base Values'!$B$10,0))","v":""},"",{"$f":"IF(OR(LEN(B49)=0,LEN(C49)=0),\"\",ROUND(B49/(C49/100)*'Base Values'!$B$12/100,0))","v":""},{"$f":"IF(LEN(B49)=0,\"\",ROUND(B49*'Base Values'!$B$14,0))","v":""},""]
[{"$f":"IF(LEN('HVI Quality Data'!A50)>0,'HVI Quality Data'!A50,\"\")","v":""},null,null,{"$f":"IF(LEN(B50)=0,\"\",ROUND($B50*'HVI Quality Data'!O50/100,0))","v":""},{"$f":"IF(LEN(B50)=0,\"\",ROUND(B50*'Base Values'!$B$16,0))","v":""},{"$f":"IF(LEN(B50)=0,\"\",ROUND(E50/2000*'Base Values'!$B$10,0))","v":""},"",{"$f":"IF(OR(LEN(B50)=0,LEN(C50)=0),\"\",ROUND(B50/(C50/100)*'Base Values'!$B$12/100,0))","v":""},{"$f":"IF(LEN(B50)=0,\"\",ROUND(B50*'Base Values'!$B$14,0))","v":""},""]
[{"$f":"IF(LEN('HVI Quality Data'!A51)>0,'HVI Quality Data'!A51,\"\")","v":""},null,null,{"$f":"IF(LEN(B51)=0,\"\",ROUND($B51*'HVI Quality Data'!O51/100,0))","v":""},{"$f":"IF(LEN(B51)=0,\"\",ROUND(B51*'Base Values'!$B$16,0))","v":""},{"$f":"IF(LEN(B51)=0,\"\",ROUND(E51/2000*'Base Values'!$B$10,0))","v":""},"",{"$f":"IF(OR(LEN(B51)=0,LEN(C51)=0),\"\",ROUND(B51/(C51/100)*'Base Values'!$B$12/100,0))","v":""},{"$f":"IF(LEN(B51)=0,\"\",ROUND(B51*'Base Values'!$B$14,0))","v":""},""]
[{"$f":"IF(LEN('HVI Quality Data'!A52)>0,'HVI Quality Data'!A52,\"\")","v":""},null,null,{"$f":"IF(LEN(B52)=0,\"\",ROUND($B52*'HVI Quality Data'!O52/100,0))","v":""},{"$f":"IF(LEN(B52)=0,\"\",ROUND(B52*'Base Values'!$B$16,0))","v":""},{"$f":"IF(LEN(B52)=0,\"\",ROUND(E52/2000*'Base Values'!$B$10,0))","v":""},"",{"$f":"IF(OR(LEN(B52)=0,LEN(C52)=0),\"\",ROUND(B52/(C52/100)*'Base Values'!$B$12/100,0))","v":""},{"$f":"IF(LEN(B52)=0,\"\",ROUND(B52*'Base Values'!$B$14,0))","v":""},""]
[{"$f":"IF(LEN('HVI Quality Data'!A53)>0,'HVI Quality Data'!A53,\"\")","v":""},null,null,{"$f":"IF(LEN(B53)=0,\"\",ROUND($B53*'HVI Quality Data'!O53/100,0))","v":""},{"$f":"IF(LEN(B53)=0,\"\",ROUND(B53*'Base Values'!$B$16,0))","v":""},{"$f":"IF(LEN(B53)=0,\"\",ROUND(E53/2000*'Base Values'!$B$10,0))","v":""},"",{"$f":"IF(OR(LEN(B53)=0,LEN(C53)=0),\"\",ROUND(B53/(C53/100)*'Base Values'!$B$12/100,0))","v":""},{"$f":"IF(LEN(B53)=0,\"\",ROUND(B53*'Base Values'!$B$14,0))","v":""},""]
[{"$f":"IF(LEN('HVI Quality Data'!A54)>0,'HVI Quality Data'!A54,\"\")","v":""},null,null,{"$f":"IF(LEN(B54)=0,\"\",ROUND($B54*'HVI Quality Data'!O54/100,0))","v":""},{"$f":"IF(LEN(B54)=0,\"\",ROUND(B54*'Base Values'!$B$16,0))","v":""},{"$f":"IF(LEN(B54)=0,\"\",ROUND(E54/2000*'Base Values'!$B$10,0))","v":""},"",{"$f":"IF(OR(LEN(B54)=0,LEN(C54)=0),\"\",ROUND(B54/(C54/100)*'Base Values'!$B$12/100,0))","v":""},{"$f":"IF(LEN(B54)=0,\"\",ROUND(B54*'Base Values'!$B$14,0))","v":""},""]
[{"$f":"IF(LEN('HVI Quality Data'!A55)>0,'HVI Quality Data'!A55,\"\")","v":""},null,null,{"$f":"IF(LEN(B55)=0,\"\",ROUND($B55*'HVI Quality Data'!R55/100,0))","v":""},{"$f":"IF(LEN(B55)=0,\"\",ROUND(B55*'Base Values'!$B$16,0))","v":""},{"$f":"IF(LEN(B55)=0,\"\",ROUND(E55/2000*'Base Values'!$B$10,0))","v":""},{"$f":"IF(LEN(B55)=0,\"\",SUM(D55,F55))","v":""},{"$f":"IF(OR(LEN(B55)=0,LEN(C55)=0),\"\",ROUND(B55/(C55/100)*'Base Values'!$B$12/100,0))","v":""},{"$f":"IF(LEN(B55)=0,\"\",ROUND(B55*'Base Values'!$B$14,0))","v":""},{"$f":"IF(OR(LEN(B55)=0,LEN(C55)=0),\"\",G55-H55-I55)","v":""}]
[{"$f":"IF(LEN('HVI Quality Data'!A56)>0,'HVI Quality Data'!A56,\"\")","v":""},null,null,{"$f":"IF(LEN(B56)=0,\"\",ROUND($B56*'HVI Quality Data'!R56/100,0))","v":""},{"$f":"IF(LEN(B56)=0,\"\",ROUND(B56*'Base Values'!$B$16,0))","v":""},{"$f":"IF(LEN(B56)=0,\"\",ROUND(E56/2000*'Base Values'!$B$10,0))","v":""},"",{"$f":"IF(OR(LEN(B56)=0,LEN(C56)=0),\"\",ROUND(B56/(C56/100)*'Base Values'!$B$12/100,0))","v":""},{"$f":"IF(LEN(B56)=0,\"\",ROUND(B56*'Base Values'!$B$14,0))","v":""},""]
[{"$f":"IF(LEN('HVI Quality Data'!A57)>0,'HVI Quality Data'!A57,\"\")","v":""},null,null,{"$f":"IF(LEN(B57)=0,\"\",ROUND($B57*'HVI Quality Data'!R57/100,0))","v":""},{"$f":"IF(LEN(B57)=0,\"\",ROUND(B57*'Base Values'!$B$16,0))","v":""},{"$f":"IF(LEN(B57)=0,\"\",ROUND(E57/2000*'Base Values'!$B$10,0))","v":""},"",{"$f":"IF(OR(LEN(B57)=0,LEN(C57)=0),\"\",ROUND(B57/(C57/100)*'Base Values'!$B$12/100,0))","v":""},{"$f":"IF(LEN(B57)=0,\"\",ROUND(B57*'Base Values'!$B$14,0))","v":""},""]
[{"$f":"IF(LEN('HVI Quality Data'!A58)>0,'HVI Quality Data'!A58,\"\")","v":""},null,null,{"$f":"IF(LEN(B58)=0,\"\",ROUND($B58*'HVI Quality Data'!R58/100,0))","v":""},{"$f":"IF(LEN(B58)=0,\"\",ROUND(B58*'Base Values'!$B$16,0))","v":""},{"$f":"IF(LEN(B58)=0,\"\",ROUND(E58/2000*'Base Values'!$B$10,0))","v":""},"",{"$f":"IF(OR(LEN(B58)=0,LEN(C58)=0),\"\",ROUND(B58/(C58/100)*'Base Values'!$B$12/100,0))","v":""},{"$f":"IF(LEN(B58)=0,\"\",ROUND(B58*'Base Values'!$B$14,0))","v":""},""]
[{"$f":"IF(LEN('HVI Quality Data'!A59)>0,'HVI Quality Data'!A59,\"\")","v":""},null,null,{"$f":"IF(LEN(B59)=0,\"\",ROUND($B59*'HVI Quality Data'!R59/100,0))","v":""},{"$f":"IF(LEN(B59)=0,\"\",ROUND(B59*'Base Values'!$B$16,0))","v":""},{"$f":"IF(LEN(B59)=0,\"\",ROUND(E59/2000*'Base Values'!$B$10,0))","v":""},"",{"$f":"IF(OR(LEN(B59)=0,LEN(C59)=0),\"\",ROUND(B59/(C59/100)*'Base Values'!$B$12/100,0))","v":""},{"$f":"IF(LEN(B59)=0,\"\",ROUND(B59*'Base Values'!$B$14,0))","v":""},""]
[{"$f":"IF(LEN('HVI Quality Data'!A60)>0,'HVI Quality Data'!A60,\"\")","v":""},null,null,{"$f":"IF(LEN(B60)=0,\"\",ROUND($B60*'HVI Quality Data'!R60/100,0))","v":""},{"$f":"IF(LEN(B60)=0,\"\",ROUND(B60*'Base Values'!$B$16,0))","v":""},{"$f":"IF(LEN(B60)=0,\"\",ROUND(E60/2000*'Base Values'!$B$10,0))","v":""},"",{"$f":"IF(OR(LEN(B60)=0,LEN(C60)=0),\"\",ROUND(B60/(C60/100)*'Base Values'!$B$12/100,0))","v":""},{"$f":"IF(LEN(B60)=0,\"\",ROUND(B60*'Base Values'!$B$14,0))","v":""},""]
[{"$f":"IF(LEN('HVI Quality Data'!A61)>0,'HVI Quality Data'!A61,\"\")","v":""},null,null,{"$f":"IF(LEN(B61)=0,\"\",ROUND($B61*'HVI Quality Data'!R61/100,0))","v":""},{"$f":"IF(LEN(B61)=0,\"\",ROUND(B61*'Base Values'!$B$16,0))","v":""},{"$f":"IF(LEN(B61)=0,\"\",ROUND(E61/2000*'Base Values'!$B$10,0))","v":""},"",{"$f":"IF(OR(LEN(B61)=0,LEN(C61)=0),\"\",ROUND(B61/(C61/100)*'Base Values'!$B$12/100,0))","v":""},{"$f":"IF(LEN(B61)=0,\"\",ROUND(B61*'Base Values'!$B$14,0))","v":""},""]
[{"$f":"IF(LEN('HVI Quality Data'!A62)>0,'HVI Quality Data'!A62,\"\")","v":""},null,null,{"$f":"IF(LEN(B62)=0,\"\",ROUND($B62*'HVI Quality Data'!R62/100,0))","v":""},{"$f":"IF(LEN(B62)=0,\"\",ROUND(B62*'Base Values'!$B$16,0))","v":""},{"$f":"IF(LEN(B62)=0,\"\",ROUND(E62/2000*'Base Values'!$B$10,0))","v":""},"",{"$f":"IF(OR(LEN(B62)=0,LEN(C62)=0),\"\",ROUND(B62/(C62/100)*'Base Values'!$B$12/100,0))","v":""},{"$f":"IF(LEN(B62)=0,\"\",ROUND(B62*'Base Values'!$B$14,0))","v":""},""]
[{"$f":"IF(LEN('HVI Quality Data'!A63)>0,'HVI Quality Data'!A63,\"\")","v":""},null,null,{"$f":"IF(LEN(B63)=0,\"\",ROUND($B63*'HVI Quality Data'!R63/100,0))","v":""},{"$f":"IF(LEN(B63)=0,\"\",ROUND(B63*'Base Values'!$B$16,0))","v":""},{"$f":"IF(LEN(B63)=0,\"\",ROUND(E63/2000*'Base Values'!$B$10,0))","v":""},"",{"$f":"IF(OR(LEN(B63)=0,LEN(C63)=0),\"\",ROUND(B63/(C63/100)*'Base Values'!$B$12/100,0))","v":""},{"$f":"IF(LEN(B63)=0,\"\",ROUND(B63*'Base Values'!$B$14,0))","v":""},""]
[{"$f":"IF(LEN('HVI Quality Data'!A64)>0,'HVI Quality Data'!A64,\"\")","v":""},null,null,{"$f":"IF(LEN(B64)=0,\"\",ROUND($B64*'HVI Quality Data'!R64/100,0))","v":""},{"$f":"IF(LEN(B64)=0,\"\",ROUND(B64*'Base Values'!$B$16,0))","v":""},{"$f":"IF(LEN(B64)=0,\"\",ROUND(E64/2000*'Base Values'!$B$10,0))","v":""},"",{"$f":"IF(OR(LEN(B64)=0,LEN(C64)=0),\"\",ROUND(B64/(C64/100)*'Base Values'!$B$12/100,0))","v":""},{"$f":"IF(LEN(B64)=0,\"\",ROUND(B64*'Base Values'!$B$14,0))","v":""},""]
[{"$f":"IF(LEN('HVI Quality Data'!A65)>0,'HVI Quality Data'!A65,\"\")","v":""},null,null,{"$f":"IF(LEN(B65)=0,\"\",ROUND($B65*'HVI Quality Data'!R65/100,0))","v":""},{"$f":"IF(LEN(B65)=0,\"\",ROUND(B65*'Base Values'!$B$16,0))","v":""},{"$f":"IF(LEN(B65)=0,\"\",ROUND(E65/2000*'Base Values'!$B$10,0))","v":""},"",{"$f":"IF(OR(LEN(B65)=0,LEN(C65)=0),\"\",ROUND(B65/(C65/100)*'Base Values'!$B$12/100,0))","v":""},{"$f":"IF(LEN(B65)=0,\"\",ROUND(B65*'Base Values'!$B$14,0))","v":""},""]
[{"$f":"IF(LEN('HVI Quality Data'!A66)>0,'HVI Quality Data'!A66,\"\")","v":""},null,null,{"$f":"IF(LEN(B66)=0,\"\",ROUND($B66*'HVI Quality Data'!R66/100,0))","v":""},{"$f":"IF(LEN(B66)=0,\"\",ROUND(B66*'Base Values'!$B$16,0))","v":""},{"$f":"IF(LEN(B66)=0,\"\",ROUND(E66/2000*'Base Values'!$B$10,0))","v":""},"",{"$f":"IF(OR(LEN(B66)=0,LEN(C66)=0),\"\",ROUND(B66/(C66/100)*'Base Values'!$B$12/100,0))","v":""},{"$f":"IF(LEN(B66)=0,\"\",ROUND(B66*'Base Values'!$B$14,0))","v":""},""]
[{"$f":"IF(LEN('HVI Quality Data'!A67)>0,'HVI Quality Data'!A67,\"\")","v":""},null,null,{"$f":"IF(LEN(B67)=0,\"\",ROUND($B67*'HVI Quality Data'!R67/100,0))","v":""},{"$f":"IF(LEN(B67)=0,\"\",ROUND(B67*'Base Values'!$B$16,0))","v":""},{"$f":"IF(LEN(B67)=0,\"\",ROUND(E67/2000*'Base Values'!$B$10,0))","v":""},"",{"$f":"IF(OR(LEN(B67)=0,LEN(C67)=0),\"\",ROUND(B67/(C67/100)*'Base Values'!$B$12/100,0))","v":""},{"$f":"IF(LEN(B67)=0,\"\",ROUND(B67*'Base Values'!$B$14,0))","v":""},""]
[{"$f":"IF(LEN('HVI Quality Data'!A68)>0,'HVI Quality Data'!A68,\"\")","v":""},null,null,{"$f":"IF(LEN(B68)=0,\"\",ROUND($B68*'HVI Quality Data'!R68/100,0))","v":""},{"$f":"IF(LEN(B68)=0,\"\",ROUND(B68*'Base Values'!$B$16,0))","v":""},{"$f":"IF(LEN(B68)=0,\"\",ROUND(E68/2000*'Base Values'!$B$10,0))","v":""},"",{"$f":"IF(OR(LEN(B68)=0,LEN(C68)=0),\"\",ROUND(B68/(C68/100)*'Base Values'!$B$12/100,0))","v":""},{"$f":"IF(LEN(B68)=0,\"\",ROUND(B68*'Base Values'!$B$14,0))","v":""},""]
[{"$f":"IF(LEN('HVI Quality Data'!A69)>0,'HVI Quality Data'!A69,\"\")","v":""},null,null,{"$f":"IF(LEN(B69)=0,\"\",ROUND($B69*'HVI Quality Data'!R69/100,0))","v":""},{"$f":"IF(LEN(B69)=0,\"\",ROUND(B69*'Base Values'!$B$16,0))","v":""},{"$f":"IF(LEN(B69)=0,\"\",ROUND(E69/2000*'Base Values'!$B$10,0))","v":""},"",{"$f":"IF(OR(LEN(B69)=0,LEN(C69)=0),\"\",ROUND(B69/(C69/100)*'Base Values'!$B$12/100,0))","v":""},{"$f":"IF(LEN(B69)=0,\"\",ROUND(B69*'Base Values'!$B$14,0))","v":""},""]
[{"$f":"IF(LEN('HVI Quality Data'!A70)>0,'HVI Quality Data'!A70,\"\")","v":""},null,null,{"$f":"IF(LEN(B70)=0,\"\",ROUND($B70*'HVI Quality Data'!R70/100,0))","v":""},{"$f":"IF(LEN(B70)=0,\"\",ROUND(B70*'Base Values'!$B$16,0))","v":""},{"$f":"IF(LEN(B70)=0,\"\",ROUND(E70/2000*'Base Values'!$B$10,0))","v":""},"",{"$f":"IF(OR(LEN(B70)=0,LEN(C70)=0),\"\",ROUND(B70/(C70/100)*'Base Values'!$B$12/100,0))","v":""},{"$f":"IF(LEN(B70)=0,\"\",ROUND(B70*'Base Values'!$B$14,0))","v":""},""]
[{"$f":"IF(LEN('HVI Quality Data'!A71)>0,'HVI Quality Data'!A71,\"\")","v":""},null,null,{"$f":"IF(LEN(B71)=0,\"\",ROUND($B71*'HVI Quality Data'!R71/100,0))","v":""},{"$f":"IF(LEN(B71)=0,\"\",ROUND(B71*'Base Values'!$B$16,0))","v":""},{"$f":"IF(LEN(B71)=0,\"\",ROUND(E71/2000*'Base Values'!$B$10,0))","v":""},"",{"$f":"IF(OR(LEN(B71)=0,LEN(C71)=0),\"\",ROUND(B71/(C71/100)*'Base Values'!$B$12/100,0))","v":""},{"$f":"IF(LEN(B71)=0,\"\",ROUND(B71*'Base Values'!$B$14,0))","v":""},""]
[{"$f":"IF(LEN('HVI Quality Data'!A72)>0,'HVI Quality Data'!A72,\"\")","v":""},null,null,{"$f":"IF(LEN(B72)=0,\"\",ROUND($B72*'HVI Quality Data'!R72/100,0))","v":""},{"$f":"IF(LEN(B72)=0,\"\",ROUND(B72*'Base Values'!$B$16,0))","v":""},{"$f":"IF(LEN(B72)=0,\"\",ROUND(E72/2000*'Base Values'!$B$10,0))","v":""},"",{"$f":"IF(OR(LEN(B72)=0,LEN(C72)=0),\"\",ROUND(B72/(C72/100)*'Base Values'!$B$12/100,0))","v":""},{"$f":"IF(LEN(B72)=0,\"\",ROUND(B72*'Base Values'!$B$14,0))","v":""},""]
[{"$f":"IF(LEN('HVI Quality Data'!A73)>0,'HVI Quality Data'!A73,\"\")","v":""},null,null,{"$f":"IF(LEN(B73)=0,\"\",ROUND($B73*'HVI Quality Data'!R73/100,0))","v":""},{"$f":"IF(LEN(B73)=0,\"\",ROUND(B73*'Base Values'!$B$16,0))","v":""},{"$f":"IF(LEN(B73)=0,\"\",ROUND(E73/2000*'Base Values'!$B$10,0))","v":""},"",{"$f":"IF(OR(LEN(B73)=0,LEN(C73)=0),\"\",ROUND(B73/(C73/100)*'Base Values'!$B$12/100,0))","v":""},{"$f":"IF(LEN(B73)=0,\"\",ROUND(B73*'Base Values'!$B$14,0))","v":""},""]
[{"$f":"IF(LEN('HVI Quality Data'!A74)>0,'HVI Quality Data'!A74,\"\")","v":""},null,null,{"$f":"IF(LEN(B74)=0,\"\",ROUND($B74*'HVI Quality Data'!R74/100,0))","v":""},{"$f":"IF(LEN(B74)=0,\"\",ROUND(B74*'Base Values'!$B$16,0))","v":""},{"$f":"IF(LEN(B74)=0,\"\",ROUND(E74/2000*'Base Values'!$B$10,0))","v":""},"",{"$f":"IF(OR(LEN(B74)=0,LEN(C74)=0),\"\",ROUND(B74/(C74/100)*'Base Values'!$B$12/100,0))","v":""},{"$f":"IF(LEN(B74)=0,\"\",ROUND(B74*'Base Values'!$B$14,0))","v":""},""]
[{"$f":"IF(LEN('HVI Quality Data'!A75)>0,'HVI Quality Data'!A75,\"\")","v":""},null,null,{"$f":"IF(LEN(B75)=0,\"\",ROUND($B75*'HVI Quality Data'!R75/100,0))","v":""},{"$f":"IF(LEN(B75)=0,\"\",ROUND(B75*'Base Values'!$B$16,0))","v":""},{"$f":"IF(LEN(B75)=0,\"\",ROUND(E75/2000*'Base Values'!$B$10,0))","v":""},"",{"$f":"IF(OR(LEN(B75)=0,LEN(C75)=0),\"\",ROUND(B75/(C75/100)*'Base Values'!$B$12/100,0))","v":""},{"$f":"IF(LEN(B75)=0,\"\",ROUND(B75*'Base Values'!$B$14,0))","v":""},""]
[{"$f":"IF(LEN('HVI Quality Data'!A76)>0,'HVI Quality Data'!A76,\"\")","v":""},null,null,{"$f":"IF(LEN(B76)=0,\"\",ROUND($B76*'HVI Quality Data'!R76/100,0))","v":""},{"$f":"IF(LEN(B76)=0,\"\",ROUND(B76*'Base Values'!$B$16,0))","v":""},{"$f":"IF(LEN(B76)=0,\"\",ROUND(E76/2000*'Base Values'!$B$10,0))","v":""},"",{"$f":"IF(OR(LEN(B76)=0,LEN(C76)=0),\"\",ROUND(B76/(C76/100)*'Base Values'!$B$12/100,0))","v":""},{"$f":"IF(LEN(B76)=0,\"\",ROUND(B76*'Base Values'!$B$14,0))","v":""},""]
[{"$f":"IF(LEN('HVI Quality Data'!A77)>0,'HVI Quality Data'!A77,\"\")","v":""},null,null,{"$f":"IF(LEN(B77)=0,\"\",ROUND($B77*'HVI Quality Data'!R77/100,0))","v":""},{"$f":"IF(LEN(B77)=0,\"\",ROUND(B77*'Base Values'!$B$16,0))","v":""},{"$f":"IF(LEN(B77)=0,\"\",ROUND(E77/2000*'Base Values'!$B$10,0))","v":""},"",{"$f":"IF(OR(LEN(B77)=0,LEN(C77)=0),\"\",ROUND(B77/(C77/100)*'Base Values'!$B$12/100,0))","v":""},{"$f":"IF(LEN(B77)=0,\"\",ROUND(B77*'Base Values'!$B$14,0))","v":""},""]
[{"$f":"IF(LEN('HVI Quality Data'!A78)>0,'HVI Quality Data'!A78,\"\")","v":""},null,null,{"$f":"IF(LEN(B78)=0,\"\",ROUND($B78*'HVI Quality Data'!R78/100,0))","v":""},{"$f":"IF(LEN(B78)=0,\"\",ROUND(B78*'Base Values'!$B$16,0))","v":""},{"$f":"IF(LEN(B78)=0,\"\",ROUND(E78/2000*'Base Values'!$B$10,0))","v":""},"",{"$f":"IF(OR(LEN(B78)=0,LEN(C78)=0),\"\",ROUND(B78/(C78/100)*'Base Values'!$B$12/100,0))","v":""},{"$f":"IF(LEN(B78)=0,\"\",ROUND(B78*'Base Values'!$B$14,0))","v":""},""]
[{"$f":"IF(LEN('HVI Quality Data'!A79)>0,'HVI Quality Data'!A79,\"\")","v":""},null,null,{"$f":"IF(LEN(B79)=0,\"\",ROUND($B79*'HVI Quality Data'!R79/100,0))","v":""},{"$f":"IF(LEN(B79)=0,\"\",ROUND(B79*'Base Values'!$B$16,0))","v":""},{"$f":"IF(LEN(B79)=0,\"\",ROUND(E79/2000*'Base Values'!$B$10,0))","v":""},"",{"$f":"IF(OR(LEN(B79)=0,LEN(C79)=0),\"\",ROUND(B79/(C79/100)*'Base Values'!$B$12/100,0))","v":""},{"$f":"IF(LEN(B79)=0,\"\",ROUND(B79*'Base Values'!$B$14,0))","v":""},""]
[{"$f":"IF(LEN('HVI Quality Data'!A80)>0,'HVI Quality Data'!A80,\"\")","v":""},null,null,{"$f":"IF(LEN(B80)=0,\"\",ROUND($B80*'HVI Quality Data'!R80/100,0))","v":""},{"$f":"IF(LEN(B80)=0,\"\",ROUND(B80*'Base Values'!$B$16,0))","v":""},{"$f":"IF(LEN(B80)=0,\"\",ROUND(E80/2000*'Base Values'!$B$10,0))","v":""},{"$f":"IF(LEN(B80)=0,\"\",SUM(D80,F80))","v":""},{"$f":"IF(OR(LEN(B80)=0,LEN(C80)=0),\"\",ROUND(B80/(C80/100)*'Base Values'!$B$12/100,0))","v":""},{"$f":"IF(LEN(B80)=0,\"\",ROUND(B80*'Base Values'!$B$14,0))","v":""},{"$f":"IF(OR(LEN(B80)=0,LEN(C80)=0),\"\",G80-H80-I80)","v":""}]
[{"$f":"IF(LEN('HVI Quality Data'!A81)>0,'HVI Quality Data'!A81,\"\")","v":""},null,null,{"$f":"IF(LEN(B81)=0,\"\",ROUND($B81*'HVI Quality Data'!R81/100,0))","v":""},{"$f":"IF(LEN(B81)=0,\"\",ROUND(B81*'Base Values'!$B$16,0))","v":""},{"$f":"IF(LEN(B81)=0,\"\",ROUND(E81/2000*'Base Values'!$B$10,0))","v":""},"",{"$f":"IF(OR(LEN(B81)=0,LEN(C81)=0),\"\",ROUND(B81/(C81/100)*'Base Values'!$B$12/100,0))","v":""},{"$f":"IF(LEN(B81)=0,\"\",ROUND(B81*'Base Values'!$B$14,0))","v":""},""]
[{"$f":"IF(LEN('HVI Quality Data'!A82)>0,'HVI Quality Data'!A82,\"\")","v":""},null,null,{"$f":"IF(LEN(B82)=0,\"\",ROUND($B82*'HVI Quality Data'!R82/100,0))","v":""},{"$f":"IF(LEN(B82)=0,\"\",ROUND(B82*'Base Values'!$B$16,0))","v":""},{"$f":"IF(LEN(B82)=0,\"\",ROUND(E82/2000*'Base Values'!$B$10,0))","v":""},"",{"$f":"IF(OR(LEN(B82)=0,LEN(C82)=0),\"\",ROUND(B82/(C82/100)*'Base Values'!$B$12/100,0))","v":""},{"$f":"IF(LEN(B82)=0,\"\",ROUND(B82*'Base Values'!$B$14,0))","v":""},""]
[{"$f":"IF(LEN('HVI Quality Data'!A83)>0,'HVI Quality Data'!A83,\"\")","v":""},null,null,{"$f":"IF(LEN(B83)=0,\"\",ROUND($B83*'HVI Quality Data'!R83/100,0))","v":""},{"$f":"IF(LEN(B83)=0,\"\",ROUND(B83*'Base Values'!$B$16,0))","v":""},{"$f":"IF(LEN(B83)=0,\"\",ROUND(E83/2000*'Base Values'!$B$10,0))","v":""},"",{"$f":"IF(OR(LEN(B83)=0,LEN(C83)=0),\"\",ROUND(B83/(C83/100)*'Base Values'!$B$12/100,0))","v":""},{"$f":"IF(LEN(B83)=0,\"\",ROUND(B83*'Base Values'!$B$14,0))","v":""},""]
[{"$f":"IF(LEN('HVI Quality Data'!A84)>0,'HVI Quality Data'!A84,\"\")","v":""},null,null,{"$f":"IF(LEN(B84)=0,\"\",ROUND($B84*'HVI Quality Data'!R84/100,0))","v":""},{"$f":"IF(LEN(B84)=0,\"\",ROUND(B84*'Base Values'!$B$16,0))","v":""},{"$f":"IF(LEN(B84)=0,\"\",ROUND(E84/2000*'Base Values'!$B$10,0))","v":""},"",{"$f":"IF(OR(LEN(B84)=0,LEN(C84)=0),\"\",ROUND(B84/(C84/100)*'Base Values'!$B$12/100,0))","v":""},{"$f":"IF(LEN(B84)=0,\"\",ROUND(B84*'Base Values'!$B$14,0))","v":""},""]
[{"$f":"IF(LEN('HVI Quality Data'!A85)>0,'HVI Quality Data'!A85,\"\")","v":""},null,null,{"$f":"IF(LEN(B85)=0,\"\",ROUND($B85*'HVI Quality Data'!R85/100,0))","v":""},{"$f":"IF(LEN(B85)=0,\"\",ROUND(B85*'Base Values'!$B$16,0))","v":""},{"$f":"IF(LEN(B85)=0,\"\",ROUND(E85/2000*'Base Values'!$B$10,0))","v":""},"",{"$f":"IF(OR(LEN(B85)=0,LEN(C85)=0),\"\",ROUND(B85/(C85/100)*'Base Values'!$B$12/100,0))","v":""},{"$f":"IF(LEN(B85)=0,\"\",ROUND(B85*'Base Values'!$B$14,0))","v":""},""]
[{"$f":"IF(LEN('HVI Quality Data'!A86)>0,'HVI Quality Data'!A86,\"\")","v":""},null,null,{"$f":"IF(LEN(B86)=0,\"\",ROUND($B86*'HVI Quality Data'!R86/100,0))","v":""},{"$f":"IF(LEN(B86)=0,\"\",ROUND(B86*'Base Values'!$B$16,0))","v":""},{"$f":"IF(LEN(B86)=0,\"\",ROUND(E86/2000*'Base Values'!$B$10,0))","v":""},"",{"$f":"IF(OR(LEN(B86)=0,LEN(C86)=0),\"\",ROUND(B86/(C86/100)*'Base Values'!$B$12/100,0))","v":""},{"$f":"IF(LEN(B86)=0,\"\",ROUND(B86*'Base Values'!$B$14,0))","v":""},""]
[{"$f":"IF(LEN('HVI Quality Data'!A87)>0,'HVI Quality Data'!A87,\"\")","v":""},null,null,{"$f":"IF(LEN(B87)=0,\"\",ROUND($B87*'HVI Quality Data'!R87/100,0))","v":""},{"$f":"IF(LEN(B87)=0,\"\",ROUND(B87*'Base Values'!$B$16,0))","v":""},{"$f":"IF(LEN(B87)=0,\"\",ROUND(E87/2000*'Base Values'!$B$10,0))","v":""},"",{"$f":"IF(OR(LEN(B87)=0,LEN(C87)=0),\"\",ROUND(B87/(C87/100)*'Base Values'!$B$12/100,0))","v":""},{"$f":"IF(LEN(B87)=0,\"\",ROUND(B87*'Base Values'!$B$14,0))","v":""},""]
[{"$f":"IF(LEN('HVI Quality Data'!A88)>0,'HVI Quality Data'!A88,\"\")","v":""},null,null,{"$f":"IF(LEN(B88)=0,\"\",ROUND($B88*'HVI Quality Data'!R88/100,0))","v":""},{"$f":"IF(LEN(B88)=0,\"\",ROUND(B88*'Base Values'!$B$16,0))","v":""},{"$f":"IF(LEN(B88)=0,\"\",ROUND(E88/2000*'Base Values'!$B$10,0))","v":""},"",{"$f":"IF(OR(LEN(B88)=0,LEN(C88)=0),\"\",ROUND(B88/(C88/100)*'Base Values'!$B$12/100,0))","v":""},{"$f":"IF(LEN(B88)=0,\"\",ROUND(B88*'Base Values'!$B$14,0))","v":""},""]
[{"$f":"IF(LEN('HVI Quality Data'!A89)>0,'HVI Quality Data'!A89,\"\")","v":""},null,null,{"$f":"IF(LEN(B89)=0,\"\",ROUND($B89*'HVI Quality Data'!R89/100,0))","v":""},{"$f":"IF(LEN(B89)=0,\"\",ROUND(B89*'Base Values'!$B$16,0))","v":""},{"$f":"IF(LEN(B89)=0,\"\",ROUND(E89/2000*'Base Values'!$B$10,0))","v":""},"",{"$f":"IF(OR(LEN(B89)=0,LEN(C89)=0),\"\",ROUND(B89/(C89/100)*'Base Values'!$B$12/100,0))","v":""},{"$f":"IF(LEN(B89)=0,\"\",ROUND(B89*'Base Values'!$B$14,0))","v":""},""]
[{"$f":"IF(LEN('HVI Quality Data'!A90)>0,'HVI Quality Data'!A90,\"\")","v":""},null,null,{"$f":"IF(LEN(B90)=0,\"\",ROUND($B90*'HVI Quality Data'!R90/100,0))","v":""},{"$f":"IF(LEN(B90)=0,\"\",ROUND(B90*'Base Values'!$B$16,0))","v":""},{"$f":"IF(LEN(B90)=0,\"\",ROUND(E90/2000*'Base Values'!$B$10,0))","v":""},"",{"$f":"IF(OR(LEN(B90)=0,LEN(C90)=0),\"\",ROUND(B90/(C90/100)*'Base Values'!$B$12/100,0))","v":""},{"$f":"IF(LEN(B90)=0,\"\",ROUND(B90*'Base Values'!$B$14,0))","v":""},""]
[{"$f":"IF(LEN('HVI Quality Data'!A91)>0,'HVI Quality Data'!A91,\"\")","v":""},null,null,{"$f":"IF(LEN(B91)=0,\"\",ROUND($B91*'HVI Quality Data'!R91/100,0))","v":""},{"$f":"IF(LEN(B91)=0,\"\",ROUND(B91*'Base Values'!$B$16,0))","v":""},{"$f":"IF(LEN(B91)=0,\"\",ROUND(E91/2000*'Base Values'!$B$10,0))","v":""},"",{"$f":"IF(OR(LEN(B91)=0,LEN(C91)=0),\"\",ROUND(B91/(C91/100)*'Base Values'!$B$12/100,0))","v":""},{"$f":"IF(LEN(B91)=0,\"\",ROUND(B91*'Base Values'!$B$14,0))","v":""},""]
[{"$f":"IF(LEN('HVI Quality Data'!A92)>0,'HVI Quality Data'!A92,\"\")","v":""},null,null,{"$f":"IF(LEN(B92)=0,\"\",ROUND($B92*'HVI Quality Data'!R92/100,0))","v":""},{"$f":"IF(LEN(B92)=0,\"\",ROUND(B92*'Base Values'!$B$16,0))","v":""},{"$f":"IF(LEN(B92)=0,\"\",ROUND(E92/2000*'Base Values'!$B$10,0))","v":""},"",{"$f":"IF(OR(LEN(B92)=0,LEN(C92)=0),\"\",ROUND(B92/(C92/100)*'Base Values'!$B$12/100,0))","v":""},{"$f":"IF(LEN(B92)=0,\"\",ROUND(B92*'Base Values'!$B$14,0))","v":""},""]
[{"$f":"IF(LEN('HVI Quality Data'!A93)>0,'HVI Quality Data'!A93,\"\")","v":""},null,null,{"$f":"IF(LEN(B93)=0,\"\",ROUND($B93*'HVI Quality Data'!R93/100,0))","v":""},{"$f":"IF(LEN(B93)=0,\"\",ROUND(B93*'Base Values'!$B$16,0))","v":""},{"$f":"IF(LEN(B93)=0,\"\",ROUND(E93/2000*'Base Values'!$B$10,0))","v":""},"",{"$f":"IF(OR(LEN(B93)=0,LEN(C93)=0),\"\",ROUND(B93/(C93/100)*'Base Values'!$B$12/100,0))","v":""},{"$f":"IF(LEN(B93)=0,\"\",ROUND(B93*'Base Values'!$B$14,0))","v":""},""]
[{"$f":"IF(LEN('HVI Quality Data'!A94)>0,'HVI Quality Data'!A94,\"\")","v":""},null,null,{"$f":"IF(LEN(B94)=0,\"\",ROUND($B94*'HVI Quality Data'!R94/100,0))","v":""},{"$f":"IF(LEN(B94)=0,\"\",ROUND(B94*'Base Values'!$B$16,0))","v":""},{"$f":"IF(LEN(B94)=0,\"\",ROUND(E94/2000*'Base Values'!$B$10,0))","v":""},"",{"$f":"IF(OR(LEN(B94)=0,LEN(C94)=0),\"\",ROUND(B94/(C94/100)*'Base Values'!$B$12/100,0))","v":""},{"$f":"IF(LEN(B94)=0,\"\",ROUND(B94*'Base Values'!$B$14,0))","v":""},""]
[{"$f":"IF(LEN('HVI Quality Data'!A95)>0,'HVI Quality Data'!A95,\"\")","v":""},null,null,{"$f":"IF(LEN(B95)=0,\"\",ROUND($B95*'HVI Quality Data'!R95/100,0))","v":""},{"$f":"IF(LEN(B95)=0,\"\",ROUND(B95*'Base Values'!$B$16,0))","v":""},{"$f":"IF(LEN(B95)=0,\"\",ROUND(E95/2000*'Base Values'!$B$10,0))","v":""},"",{"$f":"IF(OR(LEN(B95)=0,LEN(C95)=0),\"\",ROUND(B95/(C95/100)*'Base Values'!$B$12/100,0))","v":""},{"$f":"IF(LEN(B95)=0,\"\",ROUND(B95*'Base Values'!$B$14,0))","v":""},""]
[{"$f":"IF(LEN('HVI Quality Data'!A96)>0,'HVI Quality Data'!A96,\"\")","v":""},null,null,{"$f":"IF(LEN(B96)=0,\"\",ROUND($B96*'HVI Quality Data'!R96/100,0))","v":""},{"$f":"IF(LEN(B96)=0,\"\",ROUND(B96*'Base Values'!$B$16,0))","v":""},{"$f":"IF(LEN(B96)=0,\"\",ROUND(E96/2000*'Base Values'!$B$10,0))","v":""},"",{"$f":"IF(OR(LEN(B96)=0,LEN(C96)=0),\"\",ROUND(B96/(C96/100)*'Base Values'!$B$12/100,0))","v":""},{"$f":"IF(LEN(B96)=0,\"\",ROUND(B96*'Base Values'!$B$14,0))","v":""},""]
[{"$f":"IF(LEN('HVI Quality Data'!A97)>0,'HVI Quality Data'!A97,\"\")","v":""},null,null,{"$f":"IF(LEN(B97)=0,\"\",ROUND($B97*'HVI Quality Data'!R97/100,0))","v":""},{"$f":"IF(LEN(B97)=0,\"\",ROUND(B97*'Base Values'!$B$16,0))","v":""},{"$f":"IF(LEN(B97)=0,\"\",ROUND(E97/2000*'Base Values'!$B$10,0))","v":""},"",{"$f":"IF(OR(LEN(B97)=0,LEN(C97)=0),\"\",ROUND(B97/(C97/100)*'Base Values'!$B$12/100,0))","v":""},{"$f":"IF(LEN(B97)=0,\"\",ROUND(B97*'Base Values'!$B$14,0))","v":""},""]
[{"$f":"IF(LEN('HVI Quality Data'!A98)>0,'HVI Quality Data'!A98,\"\")","v":""},null,null,{"$f":"IF(LEN(B98)=0,\"\",ROUND($B98*'HVI Quality Data'!R98/100,0))","v":""},{"$f":"IF(LEN(B98)=0,\"\",ROUND(B98*'Base Values'!$B$16,0))","v":""},{"$f":"IF(LEN(B98)=0,\"\",ROUND(E98/2000*'Base Values'!$B$10,0))","v":""},"",{"$f":"IF(OR(LEN(B98)=0,LEN(C98)=0),\"\",ROUND(B98/(C98/100)*'Base Values'!$B$12/100,0))","v":""},{"$f":"IF(LEN(B98)=0,\"\",ROUND(B98*'Base Values'!$B$14,0))","v":""},""]
[{"$f":"IF(LEN('HVI Quality Data'!A99)>0,'HVI Quality Data'!A99,\"\")","v":""},null,null,{"$f":"IF(LEN(B99)=0,\"\",ROUND($B99*'HVI Quality Data'!R99/100,0))","v":""},{"$f":"IF(LEN(B99)=0,\"\",ROUND(B99*'Base Values'!$B$16,0))","v":""},{"$f":"IF(LEN(B99)=0,\"\",ROUND(E99/2000*'Base Values'!$B$10,0))","v":""},"",{"$f":"IF(OR(LEN(B99)=0,LEN(C99)=0),\"\",ROUND(B99/(C99/100)*'Base Values'!$B$12/100,0))","v":""},{"$f":"IF(LEN(B99)=0,\"\",ROUND(B99*'Base Values'!$B$14,0))","v":""},""]
[{"$f":"IF(LEN('HVI Quality Data'!A100)>0,'HVI Quality Data'!A100,\"\")","v":""},null,null,{"$f":"IF(LEN(B100)=0,\"\",ROUND($B100*'HVI Quality Data'!R100/100,0))","v":""},{"$f":"IF(LEN(B100)=0,\"\",ROUND(B100*'Base Values'!$B$16,0))","v":""},{"$f":"IF(LEN(B100)=0,\"\",ROUND(E100/2000*'Base Values'!$B$10,0))","v":""},"",{"$f":"IF(OR(LEN(B100)=0,LEN(C100)=0),\"\",ROUND(B100/(C100/100)*'Base Values'!$B$12/100,0))","v":""},{"$f":"IF(LEN(B100)=0,\"\",ROUND(B100*'Base Values'!$B$14,0))","v":""},""]
[{"$f":"IF(LEN('HVI Quality Data'!A101)>0,'HVI Quality Data'!A101,\"\")","v":""},null,null,{"$f":"IF(LEN(B101)=0,\"\",ROUND($B101*'HVI Quality Data'!R101/100,0))","v":""},{"$f":"IF(LEN(B101)=0,\"\",ROUND(B101*'Base Values'!$B$16,0))","v":""},{"$f":"IF(LEN(B101)=0,\"\",ROUND(E101/2000*'Base Values'!$B$10,0))","v":""},"",{"$f":"IF(OR(LEN(B101)=0,LEN(C101)=0),\"\",ROUND(B101/(C101/100)*'Base Values'!$B$12/100,0))","v":""},{"$f":"IF(LEN(B101)=0,\"\",ROUND(B101*'Base Values'!$B$14,0))","v":""},""]
[{"$f":"IF(LEN('HVI Quality Data'!A102)>0,'HVI Quality Data'!A102,\"\")","v":""},null,null,{"$f":"IF(LEN(B102)=0,\"\",ROUND($B102*'HVI Quality Data'!R102/100,0))","v":""},{"$f":"IF(LEN(B102)=0,\"\",ROUND(B102*'Base Values'!$B$16,0))","v":""},{"$f":"IF(LEN(B102)=0,\"\",ROUND(E102/2000*'Base Values'!$B$10,0))","v":""},"",{"$f":"IF(OR(LEN(B102)=0,LEN(C102)=0),\"\",ROUND(B102/(C102/100)*'Base Values'!$B$12/100,0))","v":""},{"$f":"IF(LEN(B102)=0,\"\",ROUND(B102*'Base Values'!$B$14,0))","v":""},""]
[{"$f":"IF(LEN('HVI Quality Data'!A103)>0,'HVI Quality Data'!A103,\"\")","v":""},null,null,{"$f":"IF(LEN(B103)=0,\"\",ROUND($B103*'HVI Quality Data'!R103/100,0))","v":""},{"$f":"IF(LEN(B103)=0,\"\",ROUND(B103*'Base Values'!$B$16,0))","v":""},{"$f":"IF(LEN(B103)=0,\"\",ROUND(E103/2000*'Base Values'!$B$10,0))","v":""},"",{"$f":"IF(OR(LEN(B103)=0,LEN(C103)=0),\"\",ROUND(B103/(C103/100)*'Base Values'!$B$12/100,0))","v":""},{"$f":"IF(LEN(B103)=0,\"\",ROUND(B103*'Base Values'!$B$14,0))","v":""},""]
[{"$f":"IF(LEN('HVI Quality Data'!A104)>0,'HVI Quality Data'!A104,\"\")","v":""},null,null,{"$f":"IF(LEN(B104)=0,\"\",ROUND($B104*'HVI Quality Data'!R104/100,0))","v":""},{"$f":"IF(LEN(B104)=0,\"\",ROUND(B104*'Base Values'!$B$16,0))","v":""},{"$f":"IF(LEN(B104)=0,\"\",ROUND(E104/2000*'Base Values'!$B$10,0))","v":""},"",{"$f":"IF(OR(LEN(B104)=0,LEN(C104)=0),\"\",ROUND(B104/(C104/100)*'Base Values'!$B$12/100,0))","v":""},{"$f":"IF(LEN(B104)=0,\"\",ROUND(B104*'Base Values'!$B$14,0))","v":""},""]
[{"$f":"IF(LEN('HVI Quality Data'!A105)>0,'HVI Quality Data'!A105,\"\")","v":""},null,null,{"$f":"IF(LEN(B105)=0,\"\",ROUND($B105*'HVI Quality Data'!R105/100,0))","v":""},{"$f":"IF(LEN(B105)=0,\"\",ROUND(B105*'Base Values'!$B$16,0))","v":""},{"$f":"IF(LEN(B105)=0,\"\",ROUND(E105/2000*'Base Values'!$B$10,0))","v":""},"",{"$f":"IF(OR(LEN(B105)=0,LEN(C105)=0),\"\",ROUND(B105/(C105/100)*'Base Values'!$B$12/100,0))","v":""},{"$f":"IF(LEN(B105)=0,\"\",ROUND(B105*'Base Values'!$B$14,0))","v":""},""]
[{"$f":"IF(LEN('HVI Quality Data'!A106)>0,'HVI Quality Data'!A106,\"\")","v":""},null,null,{"$f":"IF(LEN(B106)=0,\"\",ROUND($B106*'HVI Quality Data'!R106/100,0))","v":""},{"$f":"IF(LEN(B106)=0,\"\",ROUND(B106*'Base Values'!$B$16,0))","v":""},{"$f":"IF(LEN(B106)=0,\"\",ROUND(E106/2000*'Base Values'!$B$10,0))","v":""},"",{"$f":"IF(OR(LEN(B106)=0,LEN(C106)=0),\"\",ROUND(B106/(C106/100)*'Base Values'!$B$12/100,0))","v":""},{"$f":"IF(LEN(B106)=0,\"\",ROUND(B106*'Base Values'!$B$14,0))","v":""},""]
[{"$f":"IF(LEN('HVI Quality Data'!A107)>0,'HVI Quality Data'!A107,\"\")","v":""},null,null,{"$f":"IF(LEN(B107)=0,\"\",ROUND($B107*'HVI Quality Data'!R107/100,0))","v":""},{"$f":"IF(LEN(B107)=0,\"\",ROUND(B107*'Base Values'!$B$16,0))","v":""},{"$f":"IF(LEN(B107)=0,\"\",ROUND(E107/2000*'Base Values'!$B$10,0))","v":""},"",{"$f":"IF(OR(LEN(B107)=0,LEN(C107)=0),\"\",ROUND(B107/(C107/100)*'Base Values'!$B$12/100,0))","v":""},{"$f":"IF(LEN(B107)=0,\"\",ROUND(B107*'Base Values'!$B$14,0))","v":""},""]
[{"$f":"IF(LEN('HVI Quality Data'!A108)>0,'HVI Quality Data'!A108,\"\")","v":""},null,null,{"$f":"IF(LEN(B108)=0,\"\",ROUND($B108*'HVI Quality Data'!R108/100,0))","v":""},{"$f":"IF(LEN(B108)=0,\"\",ROUND(B108*'Base Values'!$B$16,0))","v":""},{"$f":"IF(LEN(B108)=0,\"\",ROUND(E108/2000*'Base Values'!$B$10,0))","v":""},"",{"$f":"IF(OR(LEN(B108)=0,LEN(C108)=0),\"\",ROUND(B108/(C108/100)*'Base Values'!$B$12/100,0))","v":""},{"$f":"IF(LEN(B108)=0,\"\",ROUND(B108*'Base Values'!$B$14,0))","v":""},""]
[{"$f":"IF(LEN('HVI Quality Data'!A109)>0,'HVI Quality Data'!A109,\"\")","v":""},null,null,{"$f":"IF(LEN(B109)=0,\"\",ROUND($B109*'HVI Quality Data'!R109/100,0))","v":""},{"$f":"IF(LEN(B109)=0,\"\",ROUND(B109*'Base Values'!$B$16,0))","v":""},{"$f":"IF(LEN(B109)=0,\"\",ROUND(E109/2000*'Base Values'!$B$10,0))","v":""},"",{"$f":"IF(OR(LEN(B109)=0,LEN(C109)=0),\"\",ROUND(B109/(C109/100)*'Base Values'!$B$12/100,0))","v":""},{"$f":"IF(LEN(B109)=0,\"\",ROUND(B109*'Base Values'!$B$14,0))","v":""},""]
[{"$f":"IF(LEN('HVI Quality Data'!A110)>0,'HVI Quality Data'!A110,\"\")","v":""},null,null,{"$f":"IF(LEN(B110)=0,\"\",ROUND($B110*'HVI Quality Data'!R110/100,0))","v":""},{"$f":"IF(LEN(B110)=0,\"\",ROUND(B110*'Base Values'!$B$16,0))","v":""},{"$f":"IF(LEN(B110)=0,\"\",ROUND(E110/2000*'Base Values'!$B$10,0))","v":""},"",{"$f":"IF(OR(LEN(B110)=0,LEN(C110)=0),\"\",ROUND(B110/(C110/100)*'Base Values'!$B$12/100,0))","v":""},{"$f":"IF(LEN(B110)=0,\"\",ROUND(B110*'Base Values'!$B$14,0))","v":""},""]
[{"$f":"IF(LEN('HVI Quality Data'!A111)>0,'HVI Quality Data'!A111,\"\")","v":""},null,null,{"$f":"IF(LEN(B111)=0,\"\",ROUND($B111*'HVI Quality Data'!R111/100,0))","v":""},{"$f":"IF(LEN(B111)=0,\"\",ROUND(B111*'Base Values'!$B$16,0))","v":""},{"$f":"IF(LEN(B111)=0,\"\",ROUND(E111/2000*'Base Values'!$B$10,0))","v":""},"",{"$f":"IF(OR(LEN(B111)=0,LEN(C111)=0),\"\",ROUND(B111/(C111/100)*'Base Values'!$B$12/100,0))","v":""},{"$f":"IF(LEN(B111)=0,\"\",ROUND(B111*'Base Values'!$B$14,0))","v":""},""]
[{"$f":"IF(LEN('HVI Quality Data'!A112)>0,'HVI Quality Data'!A112,\"\")","v":""},null,null,{"$f":"IF(LEN(B112)=0,\"\",ROUND($B112*'HVI Quality Data'!R112/100,0))","v":""},{"$f":"IF(LEN(B112)=0,\"\",ROUND(B112*'Base Values'!$B$16,0))","v":""},{"$f":"IF(LEN(B112)=0,\"\",ROUND(E112/2000*'Base Values'!$B$10,0))","v":""},"",{"$f":"IF(OR(LEN(B112)=0,LEN(C112)=0),\"\",ROUND(B112/(C112/100)*'Base Values'!$B$12/100,0))","v":""},{"$f":"IF(LEN(B112)=0,\"\",ROUND(B112*'Base Values'!$B$14,0))","v":""},""]
[{"$f":"IF(LEN('HVI Quality Data'!A113)>0,'HVI Quality Data'!A113,\"\")","v":""},null,null,{"$f":"IF(LEN(B113)=0,\"\",ROUND($B113*'HVI Quality Data'!R113/100,0))","v":""},{"$f":"IF(LEN(B113)=0,\"\",ROUND(B113*'Base Values'!$B$16,0))","v":""},{"$f":"IF(LEN(B113)=0,\"\",ROUND(E113/2000*'Base Values'!$B$10,0))","v":""},"",{"$f":"IF(OR(LEN(B113)=0,LEN(C113)=0),\"\",ROUND(B113/(C113/100)*'Base Values'!$B$12/100,0))","v":""},{"$f":"IF(LEN(B113)=0,\"\",ROUND(B113*'Base Values'!$B$14,0))","v":""},""]
[{"$f":"IF(LEN('HVI Quality Data'!A114)>0,'HVI Quality Data'!A114,\"\")","v":""},null,null,{"$f":"IF(LEN(B114)=0,\"\",ROUND($B114*'HVI Quality Data'!R114/100,0))","v":""},{"$f":"IF(LEN(B114)=0,\"\",ROUND(B114*'Base Values'!$B$16,0))","v":""},{"$f":"IF(LEN(B114)=0,\"\",ROUND(E114/2000*'Base Values'!$B$10,0))","v":""},"",{"$f":"IF(OR(LEN(B114)=0,LEN(C114)=0),\"\",ROUND(B114/(C114/100)*'Base Values'!$B$12/100,0))","v":""},{"$f":"IF(LEN(B114)=0,\"\",ROUND(B114*'Base Values'!$B$14,0))","v":""},""]
[{"$f":"IF(LEN('HVI Quality Data'!A115)>0,'HVI Quality Data'!A115,\"\")","v":""},null,null,{"$f":"IF(LEN(B115)=0,\"\",ROUND($B115*'HVI Quality Data'!R115/100,0))","v":""},{"$f":"IF(LEN(B115)=0,\"\",ROUND(B115*'Base Values'!$B$16,0))","v":""},{"$f":"IF(LEN(B115)=0,\"\",ROUND(E115/2000*'Base Values'!$B$10,0))","v":""},"",{"$f":"IF(OR(LEN(B115)=0,LEN(C115)=0),\"\",ROUND(B115/(C115/100)*'Base Values'!$B$12/100,0))","v":""},{"$f":"IF(LEN(B115)=0,\"\",ROUND(B115*'Base Values'!$B$14,0))","v":""},""]
[{"$f":"IF(LEN('HVI Quality Data'!A116)>0,'HVI Quality Data'!A116,\"\")","v":""},null,null,{"$f":"IF(LEN(B116)=0,\"\",ROUND($B116*'HVI Quality Data'!R116/100,0))","v":""},{"$f":"IF(LEN(B116)=0,\"\",ROUND(B116*'Base Values'!$B$16,0))","v":""},{"$f":"IF(LEN(B116)=0,\"\",ROUND(E116/2000*'Base Values'!$B$10,0))","v":""},"",{"$f":"IF(OR(LEN(B116)=0,LEN(C116)=0),\"\",ROUND(B116/(C116/100)*'Base Values'!$B$12/100,0))","v":""},{"$f":"IF(LEN(B116)=0,\"\",ROUND(B116*'Base Values'!$B$14,0))","v":""},""]
[{"$f":"IF(LEN('HVI Quality Data'!A117)>0,'HVI Quality Data'!A117,\"\")","v":""},null,null,{"$f":"IF(LEN(B117)=0,\"\",ROUND($B117*'HVI Quality Data'!R117/100,0))","v":""},{"$f":"IF(LEN(B117)=0,\"\",ROUND(B117*'Base Values'!$B$16,0))","v":""},{"$f":"IF(LEN(B117)=0,\"\",ROUND(E117/2000*'Base Values'!$B$10,0))","v":""},"",{"$f":"IF(OR(LEN(B117)=0,LEN(C117)=0),\"\",ROUND(B117/(C117/100)*'Base Values'!$B$12/100,0))","v":""},{"$f":"IF(LEN(B117)=0,\"\",ROUND(B117*'Base Values'!$B$14,0))","v":""},""]
[{"$f":"IF(LEN('HVI Quality Data'!A118)>0,'HVI Quality Data'!A118,\"\")","v":""},null,null,{"$f":"IF(LEN(B118)=0,\"\",ROUND($B118*'HVI Quality Data'!R118/100,0))","v":""},{"$f":"IF(LEN(B118)=0,\"\",ROUND(B118*'Base Values'!$B$16,0))","v":""},{"$f":"IF(LEN(B118)=0,\"\",ROUND(E118/2000*'Base Values'!$B$10,0))","v":""},"",{"$f":"IF(OR(LEN(B118)=0,LEN(C118)=0),\"\",ROUND(B118/(C118/100)*'Base Values'!$B$12/100,0))","v":""},{"$f":"IF(LEN(B118)=0,\"\",ROUND(B118*'Base Values'!$B$14,0))","v":""},""]
[{"$f":"IF(LEN('HVI Quality Data'!A119)>0,'HVI Quality Data'!A119,\"\")","v":""},null,null,{"$f":"IF(LEN(B119)=0,\"\",ROUND($B119*'HVI Quality Data'!R119/100,0))","v":""},{"$f":"IF(LEN(B119)=0,\"\",ROUND(B119*'Base Values'!$B$16,0))","v":""},{"$f":"IF(LEN(B119)=0,\"\",ROUND(E119/2000*'Base Values'!$B$10,0))","v":""},"",{"$f":"IF(OR(LEN(B119)=0,LEN(C119)=0),\"\",ROUND(B119/(C119/100)*'Base Values'!$B$12/100,0))","v":""},{"$f":"IF(LEN(B119)=0,\"\",ROUND(B119*'Base Values'!$B$14,0))","v":""},""]
[{"$f":"IF(LEN('HVI Quality Data'!A120)>0,'HVI Quality Data'!A120,\"\")","v":""},null,null,{"$f":"IF(LEN(B120)=0,\"\",ROUND($B120*'HVI Quality Data'!R120/100,0))","v":""},{"$f":"IF(LEN(B120)=0,\"\",ROUND(B120*'Base Values'!$B$16,0))","v":""},{"$f":"IF(LEN(B120)=0,\"\",ROUND(E120/2000*'Base Values'!$B$10,0))","v":""},"",{"$f":"IF(OR(LEN(B120)=0,LEN(C120)=0),\"\",ROUND(B120/(C120/100)*'Base Values'!$B$12/100,0))","v":""},{"$f":"IF(LEN(B120)=0,\"\",ROUND(B120*'Base Values'!$B$14,0))","v":""},""]
[{"$f":"IF(LEN('HVI Quality Data'!A121)>0,'HVI Quality Data'!A121,\"\")","v":""},null,null,{"$f":"IF(LEN(B121)=0,\"\",ROUND($B121*'HVI Quality Data'!R121/100,0))","v":""},{"$f":"IF(LEN(B121)=0,\"\",ROUND(B121*'Base Values'!$B$16,0))","v":""},{"$f":"IF(LEN(B121)=0,\"\",ROUND(E121/2000*'Base Values'!$B$10,0))","v":""},"",{"$f":"IF(OR(LEN(B121)=0,LEN(C121)=0),\"\",ROUND(B121/(C121/100)*'Base Values'!$B$12/100,0))","v":""},{"$f":"IF(LEN(B121)=0,\"\",ROUND(B121*'Base Values'!$B$14,0))","v":""},""]
[{"$f":"IF(LEN('HVI Quality Data'!A122)>0,'HVI Quality Data'!A122,\"\")","v":""},null,null,{"$f":"IF(LEN(B122)=0,\"\",ROUND($B122*'HVI Quality Data'!R122/100,0))","v":""},{"$f":"IF(LEN(B122)=0,\"\",ROUND(B122*'Base Values'!$B$16,0))","v":""},{"$f":"IF(LEN(B122)=0,\"\",ROUND(E122/2000*'Base Values'!$B$10,0))","v":""},"",{"$f":"IF(OR(LEN(B122)=0,LEN(C122)=0),\"\",ROUND(B122/(C122/100)*'Base Values'!$B$12/100,0))","v":""},{"$f":"IF(LEN(B122)=0,\"\",ROUND(B122*'Base Values'!$B$14,0))","v":""},""]
[{"$f":"IF(LEN('HVI Quality Data'!A123)>0,'HVI Quality Data'!A123,\"\")","v":""},null,null,{"$f":"IF(LEN(B123)=0,\"\",ROUND($B123*'HVI Quality Data'!R123/100,0))","v":""},{"$f":"IF(LEN(B123)=0,\"\",ROUND(B123*'Base Values'!$B$16,0))","v":""},{"$f":"IF(LEN(B123)=0,\"\",ROUND(E123/2000*'Base Values'!$B$10,0))","v":""},"",{"$f":"IF(OR(LEN(B123)=0,LEN(C123)=0),\"\",ROUND(B123/(C123/100)*'Base Values'!$B$12/100,0))","v":""},{"$f":"IF(LEN(B123)=0,\"\",ROUND(B123*'Base Values'!$B$14,0))","v":""},""]
[{"$f":"IF(LEN('HVI Quality Data'!A124)>0,'HVI Quality Data'!A124,\"\")","v":""},null,null,{"$f":"IF(LEN(B124)=0,\"\",ROUND($B124*'HVI Quality Data'!R124/100,0))","v":""},{"$f":"IF(LEN(B124)=0,\"\",ROUND(B124*'Base Values'!$B$16,0))","v":""},{"$f":"IF(LEN(B124)=0,\"\",ROUND(E124/2000*'Base Values'!$B$10,0))","v":""},"",{"$f":"IF(OR(LEN(B124)=0,LEN(C124)=0),\"\",ROUND(B124/(C124/100)*'Base Values'!$B$12/100,0))","v":""},{"$f":"IF(LEN(B124)=0,\"\",ROUND(B124*'Base Values'!$B$14,0))","v":""},""]
[{"$f":"IF(LEN('HVI Quality Data'!A125)>0,'HVI Quality Data'!A125,\"\")","v":""},null,null,{"$f":"IF(LEN(B125)=0,\"\",ROUND($B125*'HVI Quality Data'!R125/100,0))","v":""},{"$f":"IF(LEN(B125)=0,\"\",ROUND(B125*'Base Values'!$B$16,0))","v":""},{"$f":"IF(LEN(B125)=0,\"\",ROUND(E125/2000*'Base Values'!$B$10,0))","v":""},"",{"$f":"IF(OR(LEN(B125)=0,LEN(C125)=0),\"\",ROUND(B125/(C125/100)*'Base Values'!$B$12/100,0))","v":""},{"$f":"IF(LEN(B125)=0,\"\",ROUND(B125*'Base Values'!$B$14,0))","v":""},""]
[{"$f":"IF(LEN('HVI Quality Data'!A126)>0,'HVI Quality Data'!A126,\"\")","v":""},null,null,{"$f":"IF(LEN(B126)=0,\"\",ROUND($B126*'HVI Quality Data'!R126/100,0))","v":""},{"$f":"IF(LEN(B126)=0,\"\",ROUND(B126*'Base Values'!$B$16,0))","v":""},{"$f":"IF(LEN(B126)=0,\"\",ROUND(E126/2000*'Base Values'!$B$10,0))","v":""},"",{"$f":"IF(OR(LEN(B126)=0,LEN(C126)=0),\"\",ROUND(B126/(C126/100)*'Base Values'!$B$12/100,0))","v":""},{"$f":"IF(LEN(B126)=0,\"\",ROUND(B126*'Base Values'!$B$14,0))","v":""},""]
[{"$f":"IF(LEN('HVI Quality Data'!A127)>0,'HVI Quality Data'!A127,\"\")","v":""},null,null,{"$f":"IF(LEN(B127)=0,\"\",ROUND($B127*'HVI Quality Data'!R127/100,0))","v":""},{"$f":"IF(LEN(B127)=0,\"\",ROUND(B127*'Base Values'!$B$16,0))","v":""},{"$f":"IF(LEN(B127)=0,\"\",ROUND(E127/2000*'Base Values'!$B$10,0))","v":""},"",{"$f":"IF(OR(LEN(B127)=0,LEN(C127)=0),\"\",ROUND(B127/(C127/100)*'Base Values'!$B$12/100,0))","v":""},{"$f":"IF(LEN(B127)=0,\"\",ROUND(B127*'Base Values'!$B$14,0))","v":""},""]
[{"$f":"IF(LEN('HVI Quality Data'!A128)>0,'HVI Quality Data'!A128,\"\")","v":""},null,null,{"$f":"IF(LEN(B128)=0,\"\",ROUND($B128*'HVI Quality Data'!R128/100,0))","v":""},{"$f":"IF(LEN(B128)=0,\"\",ROUND(B128*'Base Values'!$B$16,0))","v":""},{"$f":"IF(LEN(B128)=0,\"\",ROUND(E128/2000*'Base Values'!$B$10,0))","v":""},"",{"$f":"IF(OR(LEN(B128)=0,LEN(C128)=0),\"\",ROUND(B128/(C128/100)*'Base Values'!$B$12/100,0))","v":""},{"$f":"IF(LEN(B128)=0,\"\",ROUND(B128*'Base Values'!$B$14,0))","v":""},""]
[{"$f":"IF(LEN('HVI Quality Data'!A129)>0,'HVI Quality Data'!A129,\"\")","v":""},null,null,{"$f":"IF(LEN(B129)=0,\"\",ROUND($B129*'HVI Quality Data'!R129/100,0))","v":""},{"$f":"IF(LEN(B129)=0,\"\",ROUND(B129*'Base Values'!$B$16,0))","v":""},{"$f":"IF(LEN(B129)=0,\"\",ROUND(E129/2000*'Base Values'!$B$10,0))","v":""},"",{"$f":"IF(OR(LEN(B129)=0,LEN(C129)=0),\"\",ROUND(B129/(C129/100)*'Base Values'!$B$12/100,0))","v":""},{"$f":"IF(LEN(B129)=0,\"\",ROUND(B129*'Base Values'!$B$14,0))","v":""},""]
[{"$f":"IF(LEN('HVI Quality Data'!A130)>0,'HVI Quality Data'!A130,\"\")","v":""},null,null,{"$f":"IF(LEN(B130)=0,\"\",ROUND($B130*'HVI Quality Data'!R130/100,0))","v":""},{"$f":"IF(LEN(B130)=0,\"\",ROUND(B130*'Base Values'!$B$16,0))","v":""},{"$f":"IF(LEN(B130)=0,\"\",ROUND(E130/2000*'Base Values'!$B$10,0))","v":""},"",{"$f":"IF(OR(LEN(B130)=0,LEN(C130)=0),\"\",ROUND(B130/(C130/100)*'Base Values'!$B$12/100,0))","v":""},{"$f":"IF(LEN(B130)=0,\"\",ROUND(B130*'Base Values'!$B$14,0))","v":""},""]
[{"$f":"IF(LEN('HVI Quality Data'!A131)>0,'HVI Quality Data'!A131,\"\")","v":""},null,null,{"$f":"IF(LEN(B131)=0,\"\",ROUND($B131*'HVI Quality Data'!R131/100,0))","v":""},{"$f":"IF(LEN(B131)=0,\"\",ROUND(B131*'Base Values'!$B$16,0))","v":""},{"$f":"IF(LEN(B131)=0,\"\",ROUND(E131/2000*'Base Values'!$B$10,0))","v":""},"",{"$f":"IF(OR(LEN(B131)=0,LEN(C131)=0),\"\",ROUND(B131/(C131/100)*'Base Values'!$B$12/100,0))","v":""},{"$f":"IF(LEN(B131)=0,\"\",ROUND(B131*'Base Values'!$B$14,0))","v":""},""]
[{"$f":"IF(LEN('HVI Quality Data'!A132)>0,'HVI Quality Data'!A132,\"\")","v":""},null,null,{"$f":"IF(LEN(B132)=0,\"\",ROUND($B132*'HVI Quality Data'!R132/100,0))","v":""},{"$f":"IF(LEN(B132)=0,\"\",ROUND(B132*'Base Values'!$B$16,0))","v":""},{"$f":"IF(LEN(B132)=0,\"\",ROUND(E132/2000*'Base Values'!$B$10,0))","v":""},"",{"$f":"IF(OR(LEN(B132)=0,LEN(C132)=0),\"\",ROUND(B132/(C132/100)*'Base Values'!$B$12/100,0))","v":""},{"$f":"IF(LEN(B132)=0,\"\",ROUND(B132*'Base Values'!$B$14,0))","v":""},""]
[{"$f":"IF(LEN('HVI Quality Data'!A133)>0,'HVI Quality Data'!A133,\"\")","v":""},null,null,{"$f":"IF(LEN(B133)=0,\"\",ROUND($B133*'HVI Quality Data'!R133/100,0))","v":""},{"$f":"IF(LEN(B133)=0,\"\",ROUND(B133*'Base Values'!$B$16,0))","v":""},{"$f":"IF(LEN(B133)=0,\"\",ROUND(E133/2000*'Base Values'!$B$10,0))","v":""},"",{"$f":"IF(OR(LEN(B133)=0,LEN(C133)=0),\"\",ROUND(B133/(C133/100)*'Base Values'!$B$12/100,0))","v":""},{"$f":"IF(LEN(B133)=0,\"\",ROUND(B133*'Base Values'!$B$14,0))","v":""},""]
[{"$f":"IF(LEN('HVI Quality Data'!A134)>0,'HVI Quality Data'!A134,\"\")","v":""},null,null,{"$f":"IF(LEN(B134)=0,\"\",ROUND($B134*'HVI Quality Data'!R134/100,0))","v":""},{"$f":"IF(LEN(B134)=0,\"\",ROUND(B134*'Base Values'!$B$16,0))","v":""},{"$f":"IF(LEN(B134)=0,\"\",ROUND(E134/2000*'Base Values'!$B$10,0))","v":""},"",{"$f":"IF(OR(LEN(B134)=0,LEN(C134)=0),\"\",ROUND(B134/(C134/100)*'Base Values'!$B$12/100,0))","v":""},{"$f":"IF(LEN(B134)=0,\"\",ROUND(B134*'Base Values'!$B$14,0))","v":""},""]
[{"$f":"IF(LEN('HVI Quality Data'!A135)>0,'HVI Quality Data'!A135,\"\")","v":""},null,null,{"$f":"IF(LEN(B135)=0,\"\",ROUND($B135*'HVI Quality Data'!R135/100,0))","v":""},{"$f":"IF(LEN(B135)=0,\"\",ROUND(B135*'Base Values'!$B$16,0))","v":""},{"$f":"IF(LEN(B135)=0,\"\",ROUND(E135/2000*'Base Values'!$B$10,0))","v":""},"",{"$f":"IF(OR(LEN(B135)=0,LEN(C135)=0),\"\",ROUND(B135/(C135/100)*'Base Values'!$B$12/100,0))","v":""},{"$f":"IF(LEN(B135)=0,\"\",ROUND(B135*'Base Values'!$B$14,0))","v":""},""]
[{"$f":"IF(LEN('HVI Quality Data'!A136)>0,'HVI Quality Data'!A136,\"\")","v":""},null,null,{"$f":"IF(LEN(B136)=0,\"\",ROUND($B136*'HVI Quality Data'!R136/100,0))","v":""},{"$f":"IF(LEN(B136)=0,\"\",ROUND(B136*'Base Values'!$B$16,0))","v":""},{"$f":"IF(LEN(B136)=0,\"\",ROUND(E136/2000*'Base Values'!$B$10,0))","v":""},"",{"$f":"IF(OR(LEN(B136)=0,LEN(C136)=0),\"\",ROUND(B136/(C136/100)*'Base Values'!$B$12/100,0))","v":""},{"$f":"IF(LEN(B136)=0,\"\",ROUND(B136*'Base Values'!$B$14,0))","v":""},""]
[{"$f":"IF(LEN('HVI Quality Data'!A137)>0,'HVI Quality Data'!A137,\"\")","v":""},null,null,{"$f":"IF(LEN(B137)=0,\"\",ROUND($B137*'HVI Quality Data'!R137/100,0))","v":""},{"$f":"IF(LEN(B137)=0,\"\",ROUND(B137*'Base Values'!$B$16,0))","v":""},{"$f":"IF(LEN(B137)=0,\"\",ROUND(E137/2000*'Base Values'!$B$10,0))","v":""},"",{"$f":"IF(OR(LEN(B137)=0,LEN(C137)=0),\"\",ROUND(B137/(C137/100)*'Base Values'!$B$12/100,0))","v":""},{"$f":"IF(LEN(B137)=0,\"\",ROUND(B137*'Base Values'!$B$14,0))","v":""},""]
[{"$f":"IF(LEN('HVI Quality Data'!A138)>0,'HVI Quality Data'!A138,\"\")","v":""},null,null,{"$f":"IF(LEN(B138)=0,\"\",ROUND($B138*'HVI Quality Data'!R138/100,0))","v":""},{"$f":"IF(LEN(B138)=0,\"\",ROUND(B138*'Base Values'!$B$16,0))","v":""},{"$f":"IF(LEN(B138)=0,\"\",ROUND(E138/2000*'Base Values'!$B$10,0))","v":""},"",{"$f":"IF(OR(LEN(B138)=0,LEN(C138)=0),\"\",ROUND(B138/(C138/100)*'Base Values'!$B$12/100,0))","v":""},{"$f":"IF(LEN(B138)=0,\"\",ROUND(B138*'Base Values'!$B$14,0))","v":""},""]
[{"$f":"IF(LEN('HVI Quality Data'!A139)>0,'HVI Quality Data'!A139,\"\")","v":""},null,null,{"$f":"IF(LEN(B139)=0,\"\",ROUND($B139*'HVI Quality Data'!R139/100,0))","v":""},{"$f":"IF(LEN(B139)=0,\"\",ROUND(B139*'Base Values'!$B$16,0))","v":""},{"$f":"IF(LEN(B139)=0,\"\",ROUND(E139/2000*'Base Values'!$B$10,0))","v":""},"",{"$f":"IF(OR(LEN(B139)=0,LEN(C139)=0),\"\",ROUND(B139/(C139/100)*'Base Values'!$B$12/100,0))","v":""},{"$f":"IF(LEN(B139)=0,\"\",ROUND(B139*'Base Values'!$B$14,0))","v":""},""]
[{"$f":"IF(LEN('HVI Quality Data'!A140)>0,'HVI Quality Data'!A140,\"\")","v":""},null,null,{"$f":"IF(LEN(B140)=0,\"\",ROUND($B140*'HVI Quality Data'!R140/100,0))","v":""},{"$f":"IF(LEN(B140)=0,\"\",ROUND(B140*'Base Values'!$B$16,0))","v":""},{"$f":"IF(LEN(B140)=0,\"\",ROUND(E140/2000*'Base Values'!$B$10,0))","v":""},"",{"$f":"IF(OR(LEN(B140)=0,LEN(C140)=0),\"\",ROUND(B140/(C140/100)*'Base Values'!$B$12/100,0))","v":""},{"$f":"IF(LEN(B140)=0,\"\",ROUND(B140*'Base Values'!$B$14,0))","v":""},""]
[{"$f":"IF(LEN('HVI Quality Data'!A141)>0,'HVI Quality Data'!A141,\"\")","v":""},null,null,{"$f":"IF(LEN(B141)=0,\"\",ROUND($B141*'HVI Quality Data'!R141/100,0))","v":""},{"$f":"IF(LEN(B141)=0,\"\",ROUND(B141*'Base Values'!$B$16,0))","v":""},{"$f":"IF(LEN(B141)=0,\"\",ROUND(E141/2000*'Base Values'!$B$10,0))","v":""},"",{"$f":"IF(OR(LEN(B141)=0,LEN(C141)=0),\"\",ROUND(B141/(C141/100)*'Base Values'!$B$12/100,0))","v":""},{"$f":"IF(LEN(B141)=0,\"\",ROUND(B141*'Base Values'!$B$14,0))","v":""},""]
[{"$f":"IF(LEN('HVI Quality Data'!A142)>0,'HVI Quality Data'!A142,\"\")","v":""},null,null,{"$f":"IF(LEN(B142)=0,\"\",ROUND($B142*'HVI Quality Data'!R142/100,0))","v":""},{"$f":"IF(LEN(B142)=0,\"\",ROUND(B142*'Base Values'!$B$16,0))","v":""},{"$f":"IF(LEN(B142)=0,\"\",ROUND(E142/2000*'Base Values'!$B$10,0))","v":""},"",{"$f":"IF(OR(LEN(B142)=0,LEN(C142)=0),\"\",ROUND(B142/(C142/100)*'Base Values'!$B$12/100,0))","v":""},{"$f":"IF(LEN(B142)=0,\"\",ROUND(B142*'Base Values'!$B$14,0))","v":""},""]
[{"$f":"IF(LEN('HVI Quality Data'!A143)>0,'HVI Quality Data'!A143,\"\")","v":""},null,null,{"$f":"IF(LEN(B143)=0,\"\",ROUND($B143*'HVI Quality Data'!R143/100,0))","v":""},{"$f":"IF(LEN(B143)=0,\"\",ROUND(B143*'Base Values'!$B$16,0))","v":""},{"$f":"IF(LEN(B143)=0,\"\",ROUND(E143/2000*'Base Values'!$B$10,0))","v":""},"",{"$f":"IF(OR(LEN(B143)=0,LEN(C143)=0),\"\",ROUND(B143/(C143/100)*'Base Values'!$B$12/100,0))","v":""},{"$f":"IF(LEN(B143)=0,\"\",ROUND(B143*'Base Values'!$B$14,0))","v":""},""]
[{"$f":"IF(LEN('HVI Quality Data'!A144)>0,'HVI Quality Data'!A144,\"\")","v":""},null,null,{"$f":"IF(LEN(B144)=0,\"\",ROUND($B144*'HVI Quality Data'!R144/100,0))","v":""},{"$f":"IF(LEN(B144)=0,\"\",ROUND(B144*'Base Values'!$B$16,0))","v":""},{"$f":"IF(LEN(B144)=0,\"\",ROUND(E144/2000*'Base Values'!$B$10,0))","v":""},{"$f":"IF(LEN(B144)=0,\"\",SUM(D144,F144))","v":""},{"$f":"IF(OR(LEN(B144)=0,LEN(C144)=0),\"\",ROUND(B144/(C144/100)*'Base Values'!$B$12/100,0))","v":""},{"$f":"IF(LEN(B144)=0,\"\",ROUND(B144*'Base Values'!$B$14,0))","v":""},{"$f":"IF(OR(LEN(B144)=0,LEN(C144)=0),\"\",G144-H144-I144)","v":""}]
[{"$f":"IF(LEN('HVI Quality Data'!A145)>0,'HVI Quality Data'!A145,\"\")","v":""},null,null,{"$f":"IF(LEN(B145)=0,\"\",ROUND($B145*'HVI Quality Data'!R145/100,0))","v":""},{"$f":"IF(LEN(B145)=0,\"\",ROUND(B145*'Base Values'!$B$16,0))","v":""},{"$f":"IF(LEN(B145)=0,\"\",ROUND(E145/2000*'Base Values'!$B$10,0))","v":""},"",{"$f":"IF(OR(LEN(B145)=0,LEN(C145)=0),\"\",ROUND(B145/(C145/100)*'Base Values'!$B$12/100,0))","v":""},{"$f":"IF(LEN(B145)=0,\"\",ROUND(B145*'Base Values'!$B$14,0))","v":""},""]
[{"$f":"IF(LEN('HVI Quality Data'!A146)>0,'HVI Quality Data'!A146,\"\")","v":""},null,null,{"$f":"IF(LEN(B146)=0,\"\",ROUND($B146*'HVI Quality Data'!R146/100,0))","v":""},{"$f":"IF(LEN(B146)=0,\"\",ROUND(B146*'Base Values'!$B$16,0))","v":""},{"$f":"IF(LEN(B146)=0,\"\",ROUND(E146/2000*'Base Values'!$B$10,0))","v":""},"",{"$f":"IF(OR(LEN(B146)=0,LEN(C146)=0),\"\",ROUND(B146/(C146/100)*'Base Values'!$B$12/100,0))","v":""},{"$f":"IF(LEN(B146)=0,\"\",ROUND(B146*'Base Values'!$B$14,0))","v":""},""]
[{"$f":"IF(LEN('HVI Quality Data'!A147)>0,'HVI Quality Data'!A147,\"\")","v":""},null,null,{"$f":"IF(LEN(B147)=0,\"\",ROUND($B147*'HVI Quality Data'!R147/100,0))","v":""},{"$f":"IF(LEN(B147)=0,\"\",ROUND(B147*'Base Values'!$B$16,0))","v":""},{"$f":"IF(LEN(B147)=0,\"\",ROUND(E147/2000*'Base Values'!$B$10,0))","v":""},"",{"$f":"IF(OR(LEN(B147)=0,LEN(C147)=0),\"\",ROUND(B147/(C147/100)*'Base Values'!$B$12/100,0))","v":""},{"$f":"IF(LEN(B147)=0,\"\",ROUND(B147*'Base Values'!$B$14,0))","v":""},""]
[{"$f":"IF(LEN('HVI Quality Data'!A148)>0,'HVI Quality Data'!A148,\"\")","v":""},null,null,{"$f":"IF(LEN(B148)=0,\"\",ROUND($B148*'HVI Quality Data'!R148/100,0))","v":""},{"$f":"IF(LEN(B148)=0,\"\",ROUND(B148*'Base Values'!$B$16,0))","v":""},{"$f":"IF(LEN(B148)=0,\"\",ROUND(E148/2000*'Base Values'!$B$10,0))","v":""},"",{"$f":"IF(OR(LEN(B148)=0,LEN(C148)=0),\"\",ROUND(B148/(C148/100)*'Base Values'!$B$12/100,0))","v":""},{"$f":"IF(LEN(B148)=0,\"\",ROUND(B148*'Base Values'!$B$14,0))","v":""},""]
[{"$f":"IF(LEN('HVI Quality Data'!A149)>0,'HVI Quality Data'!A149,\"\")","v":""},null,null,{"$f":"IF(LEN(B149)=0,\"\",ROUND($B149*'HVI Quality Data'!R149/100,0))","v":""},{"$f":"IF(LEN(B149)=0,\"\",ROUND(B149*'Base Values'!$B$16,0))","v":""},{"$f":"IF(LEN(B149)=0,\"\",ROUND(E149/2000*'Base Values'!$B$10,0))","v":""},"",{"$f":"IF(OR(LEN(B149)=0,LEN(C149)=0),\"\",ROUND(B149/(C149/100)*'Base Values'!$B$12/100,0))","v":""},{"$f":"IF(LEN(B149)=0,\"\",ROUND(B149*'Base Values'!$B$14,0))","v":""},""]
[{"$f":"IF(LEN('HVI Quality Data'!A150)>0,'HVI Quality Data'!A150,\"\")","v":""},null,null,{"$f":"IF(LEN(B150)=0,\"\",ROUND($B150*'HVI Quality Data'!R150/100,0))","v":""},{"$f":"IF(LEN(B150)=0,\"\",ROUND(B150*'Base Values'!$B$16,0))","v":""},{"$f":"IF(LEN(B150)=0,\"\",ROUND(E150/2000*'Base Values'!$B$10,0))","v":""},"",{"$f":"IF(OR(LEN(B150)=0,LEN(C150)=0),\"\",ROUND(B150/(C150/100)*'Base Values'!$B$12/100,0))","v":""},{"$f":"IF(LEN(B150)=0,\"\",ROUND(B150*'Base Values'!$B$14,0))","v":""},""]
[{"$f":"IF(LEN('HVI Quality Data'!A151)>0,'HVI Quality Data'!A151,\"\")","v":""},null,null,{"$f":"IF(LEN(B151)=0,\"\",ROUND($B151*'HVI Quality Data'!R151/100,0))","v":""},{"$f":"IF(LEN(B151)=0,\"\",ROUND(B151*'Base Values'!$B$16,0))","v":""},{"$f":"IF(LEN(B151)=0,\"\",ROUND(E151/2000*'Base Values'!$B$10,0))","v":""},"",{"$f":"IF(OR(LEN(B151)=0,LEN(C151)=0),\"\",ROUND(B151/(C151/100)*'Base Values'!$B$12/100,0))","v":""},{"$f":"IF(LEN(B151)=0,\"\",ROUND(B151*'Base Values'!$B$14,0))","v":""},""]
[{"$f":"IF(LEN('HVI Quality Data'!A152)>0,'HVI Quality Data'!A152,\"\")","v":""},null,null,{"$f":"IF(LEN(B152)=0,\"\",ROUND($B152*'HVI Quality Data'!R152/100,0))","v":""},{"$f":"IF(LEN(B152)=0,\"\",ROUND(B152*'Base Values'!$B$16,0))","v":""},{"$f":"IF(LEN(B152)=0,\"\",ROUND(E152/2000*'Base Values'!$B$10,0))","v":""},"",{"$f":"IF(OR(LEN(B152)=0,LEN(C152)=0),\"\",ROUND(B152/(C152/100)*'Base Values'!$B$12/100,0))","v":""},{"$f":"IF(LEN(B152)=0,\"\",ROUND(B152*'Base Values'!$B$14,0))","v":""},""]
[{"$f":"IF(LEN('HVI Quality Data'!A153)>0,'HVI Quality Data'!A153,\"\")","v":""},null,null,{"$f":"IF(LEN(B153)=0,\"\",ROUND($B153*'HVI Quality Data'!R153/100,0))","v":""},{"$f":"IF(LEN(B153)=0,\"\",ROUND(B153*'Base Values'!$B$16,0))","v":""},{"$f":"IF(LEN(B153)=0,\"\",ROUND(E153/2000*'Base Values'!$B$10,0))","v":""},"",{"$f":"IF(OR(LEN(B153)=0,LEN(C153)=0),\"\",ROUND(B153/(C153/100)*'Base Values'!$B$12/100,0))","v":""},{"$f":"IF(LEN(B153)=0,\"\",ROUND(B153*'Base Values'!$B$14,0))","v":""},""]
[{"$f":"IF(LEN('HVI Quality Data'!A154)>0,'HVI Quality Data'!A154,\"\")","v":""},null,null,{"$f":"IF(LEN(B154)=0,\"\",ROUND($B154*'HVI Quality Data'!R154/100,0))","v":""},{"$f":"IF(LEN(B154)=0,\"\",ROUND(B154*'Base Values'!$B$16,0))","v":""},{"$f":"IF(LEN(B154)=0,\"\",ROUND(E154/2000*'Base Values'!$B$10,0))","v":""},"",{"$f":"IF(OR(LEN(B154)=0,LEN(C154)=0),\"\",ROUND(B154/(C154/100)*'Base Values'!$B$12/100,0))","v":""},{"$f":"IF(LEN(B154)=0,\"\",ROUND(B154*'Base Values'!$B$14,0))","v":""},""]
[{"$f":"IF(LEN('HVI Quality Data'!A155)>0,'HVI Quality Data'!A155,\"\")","v":""},null,null,{"$f":"IF(LEN(B155)=0,\"\",ROUND($B155*'HVI Quality Data'!R155/100,0))","v":""},{"$f":"IF(LEN(B155)=0,\"\",ROUND(B155*'Base Values'!$B$16,0))","v":""},{"$f":"IF(LEN(B155)=0,\"\",ROUND(E155/2000*'Base Values'!$B$10,0))","v":""},"",{"$f":"IF(OR(LEN(B155)=0,LEN(C155)=0),\"\",ROUND(B155/(C155/100)*'Base Values'!$B$12/100,0))","v":""},{"$f":"IF(LEN(B155)=0,\"\",ROUND(B155*'Base Values'!$B$14,0))","v":""},""]
[{"$f":"IF(LEN('HVI Quality Data'!A156)>0,'HVI Quality Data'!A156,\"\")","v":""},null,null,{"$f":"IF(LEN(B156)=0,\"\",ROUND($B156*'HVI Quality Data'!R156/100,0))","v":""},{"$f":"IF(LEN(B156)=0,\"\",ROUND(B156*'Base Values'!$B$16,0))","v":""},{"$f":"IF(LEN(B156)=0,\"\",ROUND(E156/2000*'Base Values'!$B$10,0))","v":""},"",{"$f":"IF(OR(LEN(B156)=0,LEN(C156)=0),\"\",ROUND(B156/(C156/100)*'Base Values'!$B$12/100,0))","v":""},{"$f":"IF(LEN(B156)=0,\"\",ROUND(B156*'Base Values'!$B$14,0))","v":""},""]
[{"$f":"IF(LEN('HVI Quality Data'!A157)>0,'HVI Quality Data'!A157,\"\")","v":""},null,null,{"$f":"IF(LEN(B157)=0,\"\",ROUND($B157*'HVI Quality Data'!R157/100,0))","v":""},{"$f":"IF(LEN(B157)=0,\"\",ROUND(B157*'Base Values'!$B$16,0))","v":""},{"$f":"IF(LEN(B157)=0,\"\",ROUND(E157/2000*'Base Values'!$B$10,0))","v":""},"",{"$f":"IF(OR(LEN(B157)=0,LEN(C157)=0),\"\",ROUND(B157/(C157/100)*'Base Values'!$B$12/100,0))","v":""},{"$f":"IF(LEN(B157)=0,\"\",ROUND(B157*'Base Values'!$B$14,0))","v":""},""]
[{"$f":"IF(LEN('HVI Quality Data'!A158)>0,'HVI Quality Data'!A158,\"\")","v":""},null,null,{"$f":"IF(LEN(B158)=0,\"\",ROUND($B158*'HVI Quality Data'!R158/100,0))","v":""},{"$f":"IF(LEN(B158)=0,\"\",ROUND(B158*'Base Values'!$B$16,0))","v":""},{"$f":"IF(LEN(B158)=0,\"\",ROUND(E158/2000*'Base Values'!$B$10,0))","v":""},"",{"$f":"IF(OR(LEN(B158)=0,LEN(C158)=0),\"\",ROUND(B158/(C158/100)*'Base Values'!$B$12/100,0))","v":""},{"$f":"IF(LEN(B158)=0,\"\",ROUND(B158*'Base Values'!$B$14,0))","v":""},""]
[{"$f":"IF(LEN('HVI Quality Data'!A159)>0,'HVI Quality Data'!A159,\"\")","v":""},null,null,{"$f":"IF(LEN(B159)=0,\"\",ROUND($B159*'HVI Quality Data'!R159/100,0))","v":""},{"$f":"IF(LEN(B159)=0,\"\",ROUND(B159*'Base Values'!$B$16,0))","v":""},{"$f":"IF(LEN(B159)=0,\"\",ROUND(E159/2000*'Base Values'!$B$10,0))","v":""},"",{"$f":"IF(OR(LEN(B159)=0,LEN(C159)=0),\"\",ROUND(B159/(C159/100)*'Base Values'!$B$12/100,0))","v":""},{"$f":"IF(LEN(B159)=0,\"\",ROUND(B159*'Base Values'!$B$14,0))","v":""},""]
[{"$f":"IF(LEN('HVI Quality Data'!A160)>0,'HVI Quality Data'!A160,\"\")","v":""},null,null,{"$f":"IF(LEN(B160)=0,\"\",ROUND($B160*'HVI Quality Data'!R160/100,0))","v":""},{"$f":"IF(LEN(B160)=0,\"\",ROUND(B160*'Base Values'!$B$16,0))","v":""},{"$f":"IF(LEN(B160)=0,\"\",ROUND(E160/2000*'Base Values'!$B$10,0))","v":""},"",{"$f":"IF(OR(LEN(B160)=0,LEN(C160)=0),\"\",ROUND(B160/(C160/100)*'Base Values'!$B$12/100,0))","v":""},{"$f":"IF(LEN(B160)=0,\"\",ROUND(B160*'Base Values'!$B$14,0))","v":""},""]
[{"$f":"IF(LEN('HVI Quality Data'!A161)>0,'HVI Quality Data'!A161,\"\")","v":""},null,null,{"$f":"IF(LEN(B161)=0,\"\",ROUND($B161*'HVI Quality Data'!R161/100,0))","v":""},{"$f":"IF(LEN(B161)=0,\"\",ROUND(B161*'Base Values'!$B$16,0))","v":""},{"$f":"IF(LEN(B161)=0,\"\",ROUND(E161/2000*'Base Values'!$B$10,0))","v":""},"",{"$f":"IF(OR(LEN(B161)=0,LEN(C161)=0),\"\",ROUND(B161/(C161/100)*'Base Values'!$B$12/100,0))","v":""},{"$f":"IF(LEN(B161)=0,\"\",ROUND(B161*'Base Values'!$B$14,0))","v":""},""]
[{"$f":"IF(LEN('HVI Quality Data'!A162)>0,'HVI Quality Data'!A162,\"\")","v":""},null,null,{"$f":"IF(LEN(B162)=0,\"\",ROUND($B162*'HVI Quality Data'!R162/100,0))","v":""},{"$f":"IF(LEN(B162)=0,\"\",ROUND(B162*'Base Values'!$B$16,0))","v":""},{"$f":"IF(LEN(B162)=0,\"\",ROUND(E162/2000*'Base Values'!$B$10,0))","v":""},"",{"$f":"IF(OR(LEN(B162)=0,LEN(C162)=0),\"\",ROUND(B162/(C162/100)*'Base Values'!$B$12/100,0))","v":""},{"$f":"IF(LEN(B162)=0,\"\",ROUND(B162*'Base Values'!$B$14,0))","v":""},""]
[{"$f":"IF(LEN('HVI Quality Data'!A163)>0,'HVI Quality Data'!A163,\"\")","v":""},null,null,{"$f":"IF(LEN(B163)=0,\"\",ROUND($B163*'HVI Quality Data'!R163/100,0))","v":""},{"$f":"IF(LEN(B163)=0,\"\",ROUND(B163*'Base Values'!$B$16,0))","v":""},{"$f":"IF(LEN(B163)=0,\"\",ROUND(E163/2000*'Base Values'!$B$10,0))","v":""},"",{"$f":"IF(OR(LEN(B163)=0,LEN(C163)=0),\"\",ROUND(B163/(C163/100)*'Base Values'!$B$12/100,0))","v":""},{"$f":"IF(LEN(B163)=0,\"\",ROUND(B163*'Base Values'!$B$14,0))","v":""},""]
[{"$f":"IF(LEN('HVI Quality Data'!A164)>0,'HVI Quality Data'!A164,\"\")","v":""},null,null,{"$f":"IF(LEN(B164)=0,\"\",ROUND($B164*'HVI Quality Data'!R164/100,0))","v":""},{"$f":"IF(LEN(B164)=0,\"\",ROUND(B164*'Base Values'!$B$16,0))","v":""},{"$f":"IF(LEN(B164)=0,\"\",ROUND(E164/2000*'Base Values'!$B$10,0))","v":""},"",{"$f":"IF(OR(LEN(B164)=0,LEN(C164)=0),\"\",ROUND(B164/(C164/100)*'Base Values'!$B$12/100,0))","v":""},{"$f":"IF(LEN(B164)=0,\"\",ROUND(B164*'Base Values'!$B$14,0))","v":""},""]
[{"$f":"IF(LEN('HVI Quality Data'!A165)>0,'HVI Quality Data'!A165,\"\")","v":""},null,null,{"$f":"IF(LEN(B165)=0,\"\",ROUND($B165*'HVI Quality Data'!R165/100,0))","v":""},{"$f":"IF(LEN(B165)=0,\"\",ROUND(B165*'Base Values'!$B$16,0))","v":""},{"$f":"IF(LEN(B165)=0,\"\",ROUND(E165/2000*'Base Values'!$B$10,0))","v":""},"",{"$f":"IF(OR(LEN(B165)=0,LEN(C165)=0),\"\",ROUND(B165/(C165/100)*'Base Values'!$B$12/100,0))","v":""},{"$f":"IF(LEN(B165)=0,\"\",ROUND(B165*'Base Values'!$B$14,0))","v":""},""]
[{"$f":"IF(LEN('HVI Quality Data'!A166)>0,'HVI Quality Data'!A166,\"\")","v":""},null,null,{"$f":"IF(LEN(B166)=0,\"\",ROUND($B166*'HVI Quality Data'!R166/100,0))","v":""},{"$f":"IF(LEN(B166)=0,\"\",ROUND(B166*'Base Values'!$B$16,0))","v":""},{"$f":"IF(LEN(B166)=0,\"\",ROUND(E166/2000*'Base Values'!$B$10,0))","v":""},"",{"$f":"IF(OR(LEN(B166)=0,LEN(C166)=0),\"\",ROUND(B166/(C166/100)*'Base Values'!$B$12/100,0))","v":""},{"$f":"IF(LEN(B166)=0,\"\",ROUND(B166*'Base Values'!$B$14,0))","v":""},""]
[{"$f":"IF(LEN('HVI Quality Data'!A167)>0,'HVI Quality Data'!A167,\"\")","v":""},null,null,{"$f":"IF(LEN(B167)=0,\"\",ROUND($B167*'HVI Quality Data'!R167/100,0))","v":""},{"$f":"IF(LEN(B167)=0,\"\",ROUND(B167*'Base Values'!$B$16,0))","v":""},{"$f":"IF(LEN(B167)=0,\"\",ROUND(E167/2000*'Base Values'!$B$10,0))","v":""},"",{"$f":"IF(OR(LEN(B167)=0,LEN(C167)=0),\"\",ROUND(B167/(C167/100)*'Base Values'!$B$12/100,0))","v":""},{"$f":"IF(LEN(B167)=0,\"\",ROUND(B167*'Base Values'!$B$14,0))","v":""},""]
[{"$f":"IF(LEN('HVI Quality Data'!A168)>0,'HVI Quality Data'!A168,\"\")","v":""},null,null,{"$f":"IF(LEN(B168)=0,\"\",ROUND($B168*'HVI Quality Data'!R168/100,0))","v":""},{"$f":"IF(LEN(B168)=0,\"\",ROUND(B168*'Base Values'!$B$16,0))","v":""},{"$f":"IF(LEN(B168)=0,\"\",ROUND(E168/2000*'Base Values'!$B$10,0))","v":""},"",{"$f":"IF(OR(LEN(B168)=0,LEN(C168)=0),\"\",ROUND(B168/(C168/100)*'Base Values'!$B$12/100,0))","v":""},{"$f":"IF(LEN(B168)=0,\"\",ROUND(B168*'Base Values'!$B$14,0))","v":""},""]
[{"$f":"IF(LEN('HVI Quality Data'!A169)>0,'HVI Quality Data'!A169,\"\")","v":""},null,null,{"$f":"IF(LEN(B169)=0,\"\",ROUND($B169*'HVI Quality Data'!R169/100,0))","v":""},{"$f":"IF(LEN(B169)=0,\"\",ROUND(B169*'Base Values'!$B$16,0))","v":""},{"$f":"IF(LEN(B169)=0,\"\",ROUND(E169/2000*'Base Values'!$B$10,0))","v":""},"",{"$f":"IF(OR(LEN(B169)=0,LEN(C169)=0),\"\",ROUND(B169/(C169/100)*'Base Values'!$B$12/100,0))","v":""},{"$f":"IF(LEN(B169)=0,\"\",ROUND(B169*'Base Values'!$B$14,0))","v":""},""]
[{"$f":"IF(LEN('HVI Quality Data'!A170)>0,'HVI Quality Data'!A170,\"\")","v":""},null,null,{"$f":"IF(LEN(B170)=0,\"\",ROUND($B170*'HVI Quality Data'!R170/100,0))","v":""},{"$f":"IF(LEN(B170)=0,\"\",ROUND(B170*'Base Values'!$B$16,0))","v":""},{"$f":"IF(LEN(B170)=0,\"\",ROUND(E170/2000*'Base Values'!$B$10,0))","v":""},"",{"$f":"IF(OR(LEN(B170)=0,LEN(C170)=0),\"\",ROUND(B170/(C170/100)*'Base Values'!$B$12/100,0))","v":""},{"$f":"IF(LEN(B170)=0,\"\",ROUND(B170*'Base Values'!$B$14,0))","v":""},""]
[{"$f":"IF(LEN('HVI Quality Data'!A171)>0,'HVI Quality Data'!A171,\"\")","v":""},null,null,{"$f":"IF(LEN(B171)=0,\"\",ROUND($B171*'HVI Quality Data'!R171/100,0))","v":""},{"$f":"IF(LEN(B171)=0,\"\",ROUND(B171*'Base Values'!$B$16,0))","v":""},{"$f":"IF(LEN(B171)=0,\"\",ROUND(E171/2000*'Base Values'!$B$10,0))","v":""},"",{"$f":"IF(OR(LEN(B171)=0,LEN(C171)=0),\"\",ROUND(B171/(C171/100)*'Base Values'!$B$12/100,0))","v":""},{"$f":"IF(LEN(B171)=0,\"\",ROUND(B171*'Base Values'!$B$14,0))","v":""},""]
[{"$f":"IF(LEN('HVI Quality Data'!A172)>0,'HVI Quality Data'!A172,\"\")","v":""},null,null,{"$f":"IF(LEN(B172)=0,\"\",ROUND($B172*'HVI Quality Data'!R172/100,0))","v":""},{"$f":"IF(LEN(B172)=0,\"\",ROUND(B172*'Base Values'!$B$16,0))","v":""},{"$f":"IF(LEN(B172)=0,\"\",ROUND(E172/2000*'Base Values'!$B$10,0))","v":""},"",{"$f":"IF(OR(LEN(B172)=0,LEN(C172)=0),\"\",ROUND(B172/(C172/100)*'Base Values'!$B$12/100,0))","v":""},{"$f":"IF(LEN(B172)=0,\"\",ROUND(B172*'Base Values'!$B$14,0))","v":""},""]
[{"$f":"IF(LEN('HVI Quality Data'!A173)>0,'HVI Quality Data'!A173,\"\")","v":""},null,null,{"$f":"IF(LEN(B173)=0,\"\",ROUND($B173*'HVI Quality Data'!R173/100,0))","v":""},{"$f":"IF(LEN(B173)=0,\"\",ROUND(B173*'Base Values'!$B$16,0))","v":""},{"$f":"IF(LEN(B173)=0,\"\",ROUND(E173/2000*'Base Values'!$B$10,0))","v":""},"",{"$f":"IF(OR(LEN(B173)=0,LEN(C173)=0),\"\",ROUND(B173/(C173/100)*'Base Values'!$B$12/100,0))","v":""},{"$f":"IF(LEN(B173)=0,\"\",ROUND(B173*'Base Values'!$B$14,0))","v":""},""]
[{"$f":"IF(LEN('HVI Quality Data'!A174)>0,'HVI Quality Data'!A174,\"\")","v":""},null,null,{"$f":"IF(LEN(B174)=0,\"\",ROUND($B174*'HVI Quality Data'!R174/100,0))","v":""},{"$f":"IF(LEN(B174)=0,\"\",ROUND(B174*'Base Values'!$B$16,0))","v":""},{"$f":"IF(LEN(B174)=0,\"\",ROUND(E174/2000*'Base Values'!$B$10,0))","v":""},"",{"$f":"IF(OR(LEN(B174)=0,LEN(C174)=0),\"\",ROUND(B174/(C174/100)*'Base Values'!$B$12/100,0))","v":""},{"$f":"IF(LEN(B174)=0,\"\",ROUND(B174*'Base Values'!$B$14,0))","v":""},""]
[{"$f":"IF(LEN('HVI Quality Data'!A175)>0,'HVI Quality Data'!A175,\"\")","v":""},null,null,{"$f":"IF(LEN(B175)=0,\"\",ROUND($B175*'HVI Quality Data'!R175/100,0))","v":""},{"$f":"IF(LEN(B175)=0,\"\",ROUND(B175*'Base Values'!$B$16,0))","v":""},{"$f":"IF(LEN(B175)=0,\"\",ROUND(E175/2000*'Base Values'!$B$10,0))","v":""},"",{"$f":"IF(OR(LEN(B175)=0,LEN(C175)=0),\"\",ROUND(B175/(C175/100)*'Base Values'!$B$12/100,0))","v":""},{"$f":"IF(LEN(B175)=0,\"\",ROUND(B175*'Base Values'!$B$14,0))","v":""},""]
[{"$f":"IF(LEN('HVI Quality Data'!A176)>0,'HVI Quality Data'!A176,\"\")","v":""},null,null,{"$f":"IF(LEN(B176)=0,\"\",ROUND($B176*'HVI Quality Data'!R176/100,0))","v":""},{"$f":"IF(LEN(B176)=0,\"\",ROUND(B176*'Base Values'!$B$16,0))","v":""},{"$f":"IF(LEN(B176)=0,\"\",ROUND(E176/2000*'Base Values'!$B$10,0))","v":""},"",{"$f":"IF(OR(LEN(B176)=0,LEN(C176)=0),\"\",ROUND(B176/(C176/100)*'Base Values'!$B$12/100,0))","v":""},{"$f":"IF(LEN(B176)=0,\"\",ROUND(B176*'Base Values'!$B$14,0))","v":""},""]
[{"$f":"IF(LEN('HVI Quality Data'!A177)>0,'HVI Quality Data'!A177,\"\")","v":""},null,null,{"$f":"IF(LEN(B177)=0,\"\",ROUND($B177*'HVI Quality Data'!R177/100,0))","v":""},{"$f":"IF(LEN(B177)=0,\"\",ROUND(B177*'Base Values'!$B$16,0))","v":""},{"$f":"IF(LEN(B177)=0,\"\",ROUND(E177/2000*'Base Values'!$B$10,0))","v":""},"",{"$f":"IF(OR(LEN(B177)=0,LEN(C177)=0),\"\",ROUND(B177/(C177/100)*'Base Values'!$B$12/100,0))","v":""},{"$f":"IF(LEN(B177)=0,\"\",ROUND(B177*'Base Values'!$B$14,0))","v":""},""]
[{"$f":"IF(LEN('HVI Quality Data'!A178)>0,'HVI Quality Data'!A178,\"\")","v":""},null,null,{"$f":"IF(LEN(B178)=0,\"\",ROUND($B178*'HVI Quality Data'!R178/100,0))","v":""},{"$f":"IF(LEN(B178)=0,\"\",ROUND(B178*'Base Values'!$B$16,0))","v":""},{"$f":"IF(LEN(B178)=0,\"\",ROUND(E178/2000*'Base Values'!$B$10,0))","v":""},"",{"$f":"IF(OR(LEN(B178)=0,LEN(C178)=0),\"\",ROUND(B178/(C178/100)*'Base Values'!$B$12/100,0))","v":""},{"$f":"IF(LEN(B178)=0,\"\",ROUND(B178*'Base Values'!$B$14,0))","v":""},""]
[{"$f":"IF(LEN('HVI Quality Data'!A179)>0,'HVI Quality Data'!A179,\"\")","v":""},null,null,{"$f":"IF(LEN(B179)=0,\"\",ROUND($B179*'HVI Quality Data'!R179/100,0))","v":""},{"$f":"IF(LEN(B179)=0,\"\",ROUND(B179*'Base Values'!$B$16,0))","v":""},{"$f":"IF(LEN(B179)=0,\"\",ROUND(E179/2000*'Base Values'!$B$10,0))","v":""},"",{"$f":"IF(OR(LEN(B179)=0,LEN(C179)=0),\"\",ROUND(B179/(C179/100)*'Base Values'!$B$12/100,0))","v":""},{"$f":"IF(LEN(B179)=0,\"\",ROUND(B179*'Base Values'!$B$14,0))","v":""},""]
[{"$f":"IF(LEN('HVI Quality Data'!A180)>0,'HVI Quality Data'!A180,\"\")","v":""},null,null,{"$f":"IF(LEN(B180)=0,\"\",ROUND($B180*'HVI Quality Data'!R180/100,0))","v":""},{"$f":"IF(LEN(B180)=0,\"\",ROUND(B180*'Base Values'!$B$16,0))","v":""},{"$f":"IF(LEN(B180)=0,\"\",ROUND(E180/2000*'Base Values'!$B$10,0))","v":""},"",{"$f":"IF(OR(LEN(B180)=0,LEN(C180)=0),\"\",ROUND(B180/(C180/100)*'Base Values'!$B$12/100,0))","v":""},{"$f":"IF(LEN(B180)=0,\"\",ROUND(B180*'Base Values'!$B$14,0))","v":""},""]
[{"$f":"IF(LEN('HVI Quality Data'!A181)>0,'HVI Quality Data'!A181,\"\")","v":""},null,null,{"$f":"IF(LEN(B181)=0,\"\",ROUND($B181*'HVI Quality Data'!R181/100,0))","v":""},{"$f":"IF(LEN(B181)=0,\"\",ROUND(B181*'Base Values'!$B$16,0))","v":""},{"$f":"IF(LEN(B181)=0,\"\",ROUND(E181/2000*'Base Values'!$B$10,0))","v":""},"",{"$f":"IF(OR(LEN(B181)=0,LEN(C181)=0),\"\",ROUND(B181/(C181/100)*'Base Values'!$B$12/100,0))","v":""},{"$f":"IF(LEN(B181)=0,\"\",ROUND(B181*'Base Values'!$B$14,0))","v":""},""]
[{"$f":"IF(LEN('HVI Quality Data'!A182)>0,'HVI Quality Data'!A182,\"\")","v":""},null,null,{"$f":"IF(LEN(B182)=0,\"\",ROUND($B182*'HVI Quality Data'!R182/100,0))","v":""},{"$f":"IF(LEN(B182)=0,\"\",ROUND(B182*'Base Values'!$B$16,0))","v":""},{"$f":"IF(LEN(B182)=0,\"\",ROUND(E182/2000*'Base Values'!$B$10,0))","v":""},"",{"$f":"IF(OR(LEN(B182)=0,LEN(C182)=0),\"\",ROUND(B182/(C182/100)*'Base Values'!$B$12/100,0))","v":""},{"$f":"IF(LEN(B182)=0,\"\",ROUND(B182*'Base Values'!$B$14,0))","v":""},""]
[{"$f":"IF(LEN('HVI Quality Data'!A183)>0,'HVI Quality Data'!A183,\"\")","v":""},null,null,{"$f":"IF(LEN(B183)=0,\"\",ROUND($B183*'HVI Quality Data'!R183/100,0))","v":""},{"$f":"IF(LEN(B183)=0,\"\",ROUND(B183*'Base Values'!$B$16,0))","v":""},{"$f":"IF(LEN(B183)=0,\"\",ROUND(E183/2000*'Base Values'!$B$10,0))","v":""},"",{"$f":"IF(OR(LEN(B183)=0,LEN(C183)=0),\"\",ROUND(B183/(C183/100)*'Base Values'!$B$12/100,0))","v":""},{"$f":"IF(LEN(B183)=0,\"\",ROUND(B183*'Base Values'!$B$14,0))","v":""},""]
[{"$f":"IF(LEN('HVI Quality Data'!A184)>0,'HVI Quality Data'!A184,\"\")","v":""},null,null,{"$f":"IF(LEN(B184)=0,\"\",ROUND($B184*'HVI Quality Data'!R184/100,0))","v":""},{"$f":"IF(LEN(B184)=0,\"\",ROUND(B184*'Base Values'!$B$16,0))","v":""},{"$f":"IF(LEN(B184)=0,\"\",ROUND(E184/2000*'Base Values'!$B$10,0))","v":""},"",{"$f":"IF(OR(LEN(B184)=0,LEN(C184)=0),\"\",ROUND(B184/(C184/100)*'Base Values'!$B$12/100,0))","v":""},{"$f":"IF(LEN(B184)=0,\"\",ROUND(B184*'Base Values'!$B$14,0))","v":""},""]
[{"$f":"IF(LEN('HVI Quality Data'!A185)>0,'HVI Quality Data'!A185,\"\")","v":""},null,null,{"$f":"IF(LEN(B185)=0,\"\",ROUND($B185*'HVI Quality Data'!R185/100,0))","v":""},{"$f":"IF(LEN(B185)=0,\"\",ROUND(B185*'Base Values'!$B$16,0))","v":""},{"$f":"IF(LEN(B185)=0,\"\",ROUND(E185/2000*'Base Values'!$B$10,0))","v":""},"",{"$f":"IF(OR(LEN(B185)=0,LEN(C185)=0),\"\",ROUND(B185/(C185/100)*'Base Values'!$B$12/100,0))","v":""},{"$f":"IF(LEN(B185)=0,\"\",ROUND(B185*'Base Values'!$B$14,0))","v":""},""]
[{"$f":"IF(LEN('HVI Quality Data'!A186)>0,'HVI Quality Data'!A186,\"\")","v":""},null,null,{"$f":"IF(LEN(B186)=0,\"\",ROUND($B186*'HVI Quality Data'!R186/100,0))","v":""},{"$f":"IF(LEN(B186)=0,\"\",ROUND(B186*'Base Values'!$B$16,0))","v":""},{"$f":"IF(LEN(B186)=0,\"\",ROUND(E186/2000*'Base Values'!$B$10,0))","v":""},"",{"$f":"IF(OR(LEN(B186)=0,LEN(C186)=0),\"\",ROUND(B186/(C186/100)*'Base Values'!$B$12/100,0))","v":""},{"$f":"IF(LEN(B186)=0,\"\",ROUND(B186*'Base Values'!$B$14,0))","v":""},""]
[{"$f":"IF(LEN('HVI Quality Data'!A187)>0,'HVI Quality Data'!A187,\"\")","v":""},null,null,{"$f":"IF(LEN(B187)=0,\"\",ROUND($B187*'HVI Quality Data'!R187/100,0))","v":""},{"$f":"IF(LEN(B187)=0,\"\",ROUND(B187*'Base Values'!$B$16,0))","v":""},{"$f":"IF(LEN(B187)=0,\"\",ROUND(E187/2000*'Base Values'!$B$10,0))","v":""},"",{"$f":"IF(OR(LEN(B187)=0,LEN(C187)=0),\"\",ROUND(B187/(C187/100)*'Base Values'!$B$12/100,0))","v":""},{"$f":"IF(LEN(B187)=0,\"\",ROUND(B187*'Base Values'!$B$14,0))","v":""},""]
[{"$f":"IF(LEN('HVI Quality Data'!A188)>0,'HVI Quality Data'!A188,\"\")","v":""},null,null,{"$f":"IF(LEN(B188)=0,\"\",ROUND($B188*'HVI Quality Data'!R188/100,0))","v":""},{"$f":"IF(LEN(B188)=0,\"\",ROUND(B188*'Base Values'!$B$16,0))","v":""},{"$f":"IF(LEN(B188)=0,\"\",ROUND(E188/2000*'Base Values'!$B$10,0))","v":""},"",{"$f":"IF(OR(LEN(B188)=0,LEN(C188)=0),\"\",ROUND(B188/(C188/100)*'Base Values'!$B$12/100,0))","v":""},{"$f":"IF(LEN(B188)=0,\"\",ROUND(B188*'Base Values'!$B$14,0))","v":""},""]
[{"$f":"IF(LEN('HVI Quality Data'!A189)>0,'HVI Quality Data'!A189,\"\")","v":""},null,null,{"$f":"IF(LEN(B189)=0,\"\",ROUND($B189*'HVI Quality Data'!R189/100,0))","v":""},{"$f":"IF(LEN(B189)=0,\"\",ROUND(B189*'Base Values'!$B$16,0))","v":""},{"$f":"IF(LEN(B189)=0,\"\",ROUND(E189/2000*'Base Values'!$B$10,0))","v":""},"",{"$f":"IF(OR(LEN(B189)=0,LEN(C189)=0),\"\",ROUND(B189/(C189/100)*'Base Values'!$B$12/100,0))","v":""},{"$f":"IF(LEN(B189)=0,\"\",ROUND(B189*'Base Values'!$B$14,0))","v":""},""]
[{"$f":"IF(LEN('HVI Quality Data'!A190)>0,'HVI Quality Data'!A190,\"\")","v":""},null,null,{"$f":"IF(LEN(B190)=0,\"\",ROUND($B190*'HVI Quality Data'!R190/100,0))","v":""},{"$f":"IF(LEN(B190)=0,\"\",ROUND(B190*'Base Values'!$B$16,0))","v":""},{"$f":"IF(LEN(B190)=0,\"\",ROUND(E190/2000*'Base Values'!$B$10,0))","v":""},"",{"$f":"IF(OR(LEN(B190)=0,LEN(C190)=0),\"\",ROUND(B190/(C190/100)*'Base Values'!$B$12/100,0))","v":""},{"$f":"IF(LEN(B190)=0,\"\",ROUND(B190*'Base Values'!$B$14,0))","v":""},""]
[{"$f":"IF(LEN('HVI Quality Data'!A191)>0,'HVI Quality Data'!A191,\"\")","v":""},null,null,{"$f":"IF(LEN(B191)=0,\"\",ROUND($B191*'HVI Quality Data'!R191/100,0))","v":""},{"$f":"IF(LEN(B191)=0,\"\",ROUND(B191*'Base Values'!$B$16,0))","v":""},{"$f":"IF(LEN(B191)=0,\"\",ROUND(E191/2000*'Base Values'!$B$10,0))","v":""},"",{"$f":"IF(OR(LEN(B191)=0,LEN(C191)=0),\"\",ROUND(B191/(C191/100)*'Base Values'!$B$12/100,0))","v":""},{"$f":"IF(LEN(B191)=0,\"\",ROUND(B191*'Base Values'!$B$14,0))","v":""},""]
[{"$f":"IF(LEN('HVI Quality Data'!A192)>0,'HVI Quality Data'!A192,\"\")","v":""},null,null,{"$f":"IF(LEN(B192)=0,\"\",ROUND($B192*'HVI Quality Data'!R192/100,0))","v":""},{"$f":"IF(LEN(B192)=0,\"\",ROUND(B192*'Base Values'!$B$16,0))","v":""},{"$f":"IF(LEN(B192)=0,\"\",ROUND(E192/2000*'Base Values'!$B$10,0))","v":""},"",{"$f":"IF(OR(LEN(B192)=0,LEN(C192)=0),\"\",ROUND(B192/(C192/100)*'Base Values'!$B$12/100,0))","v":""},{"$f":"IF(LEN(B192)=0,\"\",ROUND(B192*'Base Values'!$B$14,0))","v":""},""]
[{"$f":"IF(LEN('HVI Quality Data'!A193)>0,'HVI Quality Data'!A193,\"\")","v":""},null,null,{"$f":"IF(LEN(B193)=0,\"\",ROUND($B193*'HVI Quality Data'!R193/100,0))","v":""},{"$f":"IF(LEN(B193)=0,\"\",ROUND(B193*'Base Values'!$B$16,0))","v":""},{"$f":"IF(LEN(B193)=0,\"\",ROUND(E193/2000*'Base Values'!$B$10,0))","v":""},"",{"$f":"IF(OR(LEN(B193)=0,LEN(C193)=0),\"\",ROUND(B193/(C193/100)*'Base Values'!$B$12/100,0))","v":""},{"$f":"IF(LEN(B193)=0,\"\",ROUND(B193*'Base Values'!$B$14,0))","v":""},""]
[{"$f":"IF(LEN('HVI Quality Data'!A194)>0,'HVI Quality Data'!A194,\"\")","v":""},null,null,{"$f":"IF(LEN(B194)=0,\"\",ROUND($B194*'HVI Quality Data'!R194/100,0))","v":""},{"$f":"IF(LEN(B194)=0,\"\",ROUND(B194*'Base Values'!$B$16,0))","v":""},{"$f":"IF(LEN(B194)=0,\"\",ROUND(E194/2000*'Base Values'!$B$10,0))","v":""},"",{"$f":"IF(OR(LEN(B194)=0,LEN(C194)=0),\"\",ROUND(B194/(C194/100)*'Base Values'!$B$12/100,0))","v":""},{"$f":"IF(LEN(B194)=0,\"\",ROUND(B194*'Base Values'!$B$14,0))","v":""},""]
[{"$f":"IF(LEN('HVI Quality Data'!A195)>0,'HVI Quality Data'!A195,\"\")","v":""},null,null,{"$f":"IF(LEN(B195)=0,\"\",ROUND($B195*'HVI Quality Data'!R195/100,0))","v":""},{"$f":"IF(LEN(B195)=0,\"\",ROUND(B195*'Base Values'!$B$16,0))","v":""},{"$f":"IF(LEN(B195)=0,\"\",ROUND(E195/2000*'Base Values'!$B$10,0))","v":""},"",{"$f":"IF(OR(LEN(B195)=0,LEN(C195)=0),\"\",ROUND(B195/(C195/100)*'Base Values'!$B$12/100,0))","v":""},{"$f":"IF(LEN(B195)=0,\"\",ROUND(B195*'Base Values'!$B$14,0))","v":""},""]
[{"$f":"IF(LEN('HVI Quality Data'!A196)>0,'HVI Quality Data'!A196,\"\")","v":""},null,null,{"$f":"IF(LEN(B196)=0,\"\",ROUND($B196*'HVI Quality Data'!R196/100,0))","v":""},{"$f":"IF(LEN(B196)=0,\"\",ROUND(B196*'Base Values'!$B$16,0))","v":""},{"$f":"IF(LEN(B196)=0,\"\",ROUND(E196/2000*'Base Values'!$B$10,0))","v":""},"",{"$f":"IF(OR(LEN(B196)=0,LEN(C196)=0),\"\",ROUND(B196/(C196/100)*'Base Values'!$B$12/100,0))","v":""},{"$f":"IF(LEN(B196)=0,\"\",ROUND(B196*'Base Values'!$B$14,0))","v":""},""]
[{"$f":"IF(LEN('HVI Quality Data'!A197)>0,'HVI Quality Data'!A197,\"\")","v":""},null,null,{"$f":"IF(LEN(B197)=0,\"\",ROUND($B197*'HVI Quality Data'!R197/100,0))","v":""},{"$f":"IF(LEN(B197)=0,\"\",ROUND(B197*'Base Values'!$B$16,0))","v":""},{"$f":"IF(LEN(B197)=0,\"\",ROUND(E197/2000*'Base Values'!$B$10,0))","v":""},"",{"$f":"IF(OR(LEN(B197)=0,LEN(C197)=0),\"\",ROUND(B197/(C197/100)*'Base Values'!$B$12/100,0))","v":""},{"$f":"IF(LEN(B197)=0,\"\",ROUND(B197*'Base Values'!$B$14,0))","v":""},""]
[{"$f":"IF(LEN('HVI Quality Data'!A198)>0,'HVI Quality Data'!A198,\"\")","v":""},null,null,{"$f":"IF(LEN(B198)=0,\"\",ROUND($B198*'HVI Quality Data'!R198/100,0))","v":""},{"$f":"IF(LEN(B198)=0,\"\",ROUND(B198*'Base Values'!$B$16,0))","v":""},{"$f":"IF(LEN(B198)=0,\"\",ROUND(E198/2000*'Base Values'!$B$10,0))","v":""},"",{"$f":"IF(OR(LEN(B198)=0,LEN(C198)=0),\"\",ROUND(B198/(C198/100)*'Base Values'!$B$12/100,0))","v":""},{"$f":"IF(LEN(B198)=0,\"\",ROUND(B198*'Base Values'!$B$14,0))","v":""},""]
[{"$f":"IF(LEN('HVI Quality Data'!A199)>0,'HVI Quality Data'!A199,\"\")","v":""},null,null,{"$f":"IF(LEN(B199)=0,\"\",ROUND($B199*'HVI Quality Data'!R199/100,0))","v":""},{"$f":"IF(LEN(B199)=0,\"\",ROUND(B199*'Base Values'!$B$16,0))","v":""},{"$f":"IF(LEN(B199)=0,\"\",ROUND(E199/2000*'Base Values'!$B$10,0))","v":""},"",{"$f":"IF(OR(LEN(B199)=0,LEN(C199)=0),\"\",ROUND(B199/(C199/100)*'Base Values'!$B$12/100,0))","v":""},{"$f":"IF(LEN(B199)=0,\"\",ROUND(B199*'Base Values'!$B$14,0))","v":""},""]
[{"$f":"IF(LEN('HVI Quality Data'!A200)>0,'HVI Quality Data'!A200,\"\")","v":""},null,null,{"$f":"IF(LEN(B200)=0,\"\",ROUND($B200*'HVI Quality Data'!R200/100,0))","v":""},{"$f":"IF(LEN(B200)=0,\"\",ROUND(B200*'Base Values'!$B$16,0))","v":""},{"$f":"IF(LEN(B200)=0,\"\",ROUND(E200/2000*'Base Values'!$B$10,0))","v":""},"",{"$f":"IF(OR(LEN(B200)=0,LEN(C200)=0),\"\",ROUND(B200/(C200/100)*'Base Values'!$B$12/100,0))","v":""},{"$f":"IF(LEN(B200)=0,\"\",ROUND(B200*'Base Values'!$B$14,0))","v":""},""]
[{"$f":"IF(LEN('HVI Quality Data'!A201)>0,'HVI Quality Data'!A201,\"\")","v":""},null,null,{"$f":"IF(LEN(B201)=0,\"\",ROUND($B201*'HVI Quality Data'!R201/100,0))","v":""},{"$f":"IF(LEN(B201)=0,\"\",ROUND(B201*'Base Values'!$B$16,0))","v":""},{"$f":"IF(LEN(B201)=0,\"\",ROUND(E201/2000*'Base Values'!$B$10,0))","v":""},"",{"$f":"IF(OR(LEN(B201)=0,LEN(C201)=0),\"\",ROUND(B201/(C201/100)*'Base Values'!$B$12/100,0))","v":""},{"$f":"IF(LEN(B201)=0,\"\",ROUND(B201*'Base Values'!$B$14,0))","v":""},""]
[{"$f":"IF(LEN('HVI Quality Data'!A202)>0,'HVI Quality Data'!A202,\"\")","v":""},null,null,{"$f":"IF(LEN(B202)=0,\"\",ROUND($B202*'HVI Quality Data'!R202/100,0))","v":""},{"$f":"IF(LEN(B202)=0,\"\",ROUND(B202*'Base Values'!$B$16,0))","v":""},{"$f":"IF(LEN(B202)=0,\"\",ROUND(E202/2000*'Base Values'!$B$10,0))","v":""},"",{"$f":"IF(OR(LEN(B202)=0,LEN(C202)=0),\"\",ROUND(B202/(C202/100)*'Base Values'!$B$12/100,0))","v":""},{"$f":"IF(LEN(B202)=0,\"\",ROUND(B202*'Base Values'!$B$14,0))","v":""},""]
[{"$f":"IF(LEN('HVI Quality Data'!A203)>0,'HVI Quality Data'!A203,\"\")","v":""},null,null,{"$f":"IF(LEN(B203)=0,\"\",ROUND($B203*'HVI Quality Data'!R203/100,0))","v":""},{"$f":"IF(LEN(B203)=0,\"\",ROUND(B203*'Base Values'!$B$16,0))","v":""},{"$f":"IF(LEN(B203)=0,\"\",ROUND(E203/2000*'Base Values'!$B$10,0))","v":""},"",{"$f":"IF(OR(LEN(B203)=0,LEN(C203)=0),\"\",ROUND(B203/(C203/100)*'Base Values'!$B$12/100,0))","v":""},{"$f":"IF(LEN(B203)=0,\"\",ROUND(B203*'Base Values'!$B$14,0))","v":""},""]
[{"$f":"IF(LEN('HVI Quality Data'!A204)>0,'HVI Quality Data'!A204,\"\")","v":""},null,null,{"$f":"IF(LEN(B204)=0,\"\",ROUND($B204*'HVI Quality Data'!R204/100,0))","v":""},{"$f":"IF(LEN(B204)=0,\"\",ROUND(B204*'Base Values'!$B$16,0))","v":""},{"$f":"IF(LEN(B204)=0,\"\",ROUND(E204/2000*'Base Values'!$B$10,0))","v":""},"",{"$f":"IF(OR(LEN(B204)=0,LEN(C204)=0),\"\",ROUND(B204/(C204/100)*'Base Values'!$B$12/100,0))","v":""},{"$f":"IF(LEN(B204)=0,\"\",ROUND(B204*'Base Values'!$B$14,0))","v":""},""]
[{"$f":"IF(LEN('HVI Quality Data'!A205)>0,'HVI Quality Data'!A205,\"\")","v":""},null,null,{"$f":"IF(LEN(B205)=0,\"\",ROUND($B205*'HVI Quality Data'!R205/100,0))","v":""},{"$f":"IF(LEN(B205)=0,\"\",ROUND(B205*'Base Values'!$B$16,0))","v":""},{"$f":"IF(LEN(B205)=0,\"\",ROUND(E205/2000*'Base Values'!$B$10,0))","v":""},"",{"$f":"IF(OR(LEN(B205)=0,LEN(C205)=0),\"\",ROUND(B205/(C205/100)*'Base Values'!$B$12/100,0))","v":""},{"$f":"IF(LEN(B205)=0,\"\",ROUND(B205*'Base Values'!$B$14,0))","v":""},""]
[{"$f":"IF(LEN('HVI Quality Data'!A206)>0,'HVI Quality Data'!A206,\"\")","v":""},null,null,{"$f":"IF(LEN(B206)=0,\"\",ROUND($B206*'HVI Quality Data'!R206/100,0))","v":""},{"$f":"IF(LEN(B206)=0,\"\",ROUND(B206*'Base Values'!$B$16,0))","v":""},{"$f":"IF(LEN(B206)=0,\"\",ROUND(E206/2000*'Base Values'!$B$10,0))","v":""},"",{"$f":"IF(OR(LEN(B206)=0,LEN(C206)=0),\"\",ROUND(B206/(C206/100)*'Base Values'!$B$12/100,0))","v":""},{"$f":"IF(LEN(B206)=0,\"\",ROUND(B206*'Base Values'!$B$14,0))","v":""},""]
[{"$f":"IF(LEN('HVI Quality Data'!A207)>0,'HVI Quality Data'!A207,\"\")","v":""},null,null,{"$f":"IF(LEN(B207)=0,\"\",ROUND($B207*'HVI Quality Data'!R207/100,0))","v":""},{"$f":"IF(LEN(B207)=0,\"\",ROUND(B207*'Base Values'!$B$16,0))","v":""},{"$f":"IF(LEN(B207)=0,\"\",ROUND(E207/2000*'Base Values'!$B$10,0))","v":""},"",{"$f":"IF(OR(LEN(B207)=0,LEN(C207)=0),\"\",ROUND(B207/(C207/100)*'Base Values'!$B$12/100,0))","v":""},{"$f":"IF(LEN(B207)=0,\"\",ROUND(B207*'Base Values'!$B$14,0))","v":""},""]
[{"$f":"IF(LEN('HVI Quality Data'!A208)>0,'HVI Quality Data'!A208,\"\")","v":""},null,null,{"$f":"IF(LEN(B208)=0,\"\",ROUND($B208*'HVI Quality Data'!R208/100,0))","v":""},{"$f":"IF(LEN(B208)=0,\"\",ROUND(B208*'Base Values'!$B$16,0))","v":""},{"$f":"IF(LEN(B208)=0,\"\",ROUND(E208/2000*'Base Values'!$B$10,0))","v":""},{"$f":"IF(LEN(B208)=0,\"\",SUM(D208,F208))","v":""},{"$f":"IF(OR(LEN(B208)=0,LEN(C208)=0),\"\",ROUND(B208/(C208/100)*'Base Values'!$B$12/100,0))","v":""},{"$f":"IF(LEN(B208)=0,\"\",ROUND(B208*'Base Values'!$B$14,0))","v":""},{"$f":"IF(OR(LEN(B208)=0,LEN(C208)=0),\"\",G208-H208-I208)","v":""}]
[{"$f":"IF(LEN('HVI Quality Data'!A209)>0,'HVI Quality Data'!A209,\"\")","v":""},null,null,{"$f":"IF(LEN(B209)=0,\"\",ROUND($B209*'HVI Quality Data'!R209/100,0))","v":""},{"$f":"IF(LEN(B209)=0,\"\",ROUND(B209*'Base Values'!$B$16,0))","v":""},{"$f":"IF(LEN(B209)=0,\"\",ROUND(E209/2000*'Base Values'!$B$10,0))","v":""},"",{"$f":"IF(OR(LEN(B209)=0,LEN(C209)=0),\"\",ROUND(B209/(C209/100)*'Base Values'!$B$12/100,0))","v":""},{"$f":"IF(LEN(B209)=0,\"\",ROUND(B209*'Base Values'!$B$14,0))","v":""},""]
[{"$f":"IF(LEN('HVI Quality Data'!A210)>0,'HVI Quality Data'!A210,\"\")","v":""},null,null,{"$f":"IF(LEN(B210)=0,\"\",ROUND($B210*'HVI Quality Data'!R210/100,0))","v":""},{"$f":"IF(LEN(B210)=0,\"\",ROUND(B210*'Base Values'!$B$16,0))","v":""},{"$f":"IF(LEN(B210)=0,\"\",ROUND(E210/2000*'Base Values'!$B$10,0))","v":""},"",{"$f":"IF(OR(LEN(B210)=0,LEN(C210)=0),\"\",ROUND(B210/(C210/100)*'Base Values'!$B$12/100,0))","v":""},{"$f":"IF(LEN(B210)=0,\"\",ROUND(B210*'Base Values'!$B$14,0))","v":""},""]
[{"$f":"IF(LEN('HVI Quality Data'!A211)>0,'HVI Quality Data'!A211,\"\")","v":""},null,null,{"$f":"IF(LEN(B211)=0,\"\",ROUND($B211*'HVI Quality Data'!R211/100,0))","v":""},{"$f":"IF(LEN(B211)=0,\"\",ROUND(B211*'Base Values'!$B$16,0))","v":""},{"$f":"IF(LEN(B211)=0,\"\",ROUND(E211/2000*'Base Values'!$B$10,0))","v":""},"",{"$f":"IF(OR(LEN(B211)=0,LEN(C211)=0),\"\",ROUND(B211/(C211/100)*'Base Values'!$B$12/100,0))","v":""},{"$f":"IF(LEN(B211)=0,\"\",ROUND(B211*'Base Values'!$B$14,0))","v":""},""]
[{"$f":"IF(LEN('HVI Quality Data'!A212)>0,'HVI Quality Data'!A212,\"\")","v":""},null,null,{"$f":"IF(LEN(B212)=0,\"\",ROUND($B212*'HVI Quality Data'!R212/100,0))","v":""},{"$f":"IF(LEN(B212)=0,\"\",ROUND(B212*'Base Values'!$B$16,0))","v":""},{"$f":"IF(LEN(B212)=0,\"\",ROUND(E212/2000*'Base Values'!$B$10,0))","v":""},"",{"$f":"IF(OR(LEN(B212)=0,LEN(C212)=0),\"\",ROUND(B212/(C212/100)*'Base Values'!$B$12/100,0))","v":""},{"$f":"IF(LEN(B212)=0,\"\",ROUND(B212*'Base Values'!$B$14,0))","v":""},""]
[{"$f":"IF(LEN('HVI Quality Data'!A213)>0,'HVI Quality Data'!A213,\"\")","v":""},null,null,{"$f":"IF(LEN(B213)=0,\"\",ROUND($B213*'HVI Quality Data'!R213/100,0))","v":""},{"$f":"IF(LEN(B213)=0,\"\",ROUND(B213*'Base Values'!$B$16,0))","v":""},{"$f":"IF(LEN(B213)=0,\"\",ROUND(E213/2000*'Base Values'!$B$10,0))","v":""},"",{"$f":"IF(OR(LEN(B213)=0,LEN(C213)=0),\"\",ROUND(B213/(C213/100)*'Base Values'!$B$12/100,0))","v":""},{"$f":"IF(LEN(B213)=0,\"\",ROUND(B213*'Base Values'!$B$14,0))","v":""},""]
[{"$f":"IF(LEN('HVI Quality Data'!A214)>0,'HVI Quality Data'!A214,\"\")","v":""},null,null,{"$f":"IF(LEN(B214)=0,\"\",ROUND($B214*'HVI Quality Data'!R214/100,0))","v":""},{"$f":"IF(LEN(B214)=0,\"\",ROUND(B214*'Base Values'!$B$16,0))","v":""},{"$f":"IF(LEN(B214)=0,\"\",ROUND(E214/2000*'Base Values'!$B$10,0))","v":""},"",{"$f":"IF(OR(LEN(B214)=0,LEN(C214)=0),\"\",ROUND(B214/(C214/100)*'Base Values'!$B$12/100,0))","v":""},{"$f":"IF(LEN(B214)=0,\"\",ROUND(B214*'Base Values'!$B$14,0))","v":""},""]
[{"$f":"IF(LEN('HVI Quality Data'!A215)>0,'HVI Quality Data'!A215,\"\")","v":""},null,null,{"$f":"IF(LEN(B215)=0,\"\",ROUND($B215*'HVI Quality Data'!R215/100,0))","v":""},{"$f":"IF(LEN(B215)=0,\"\",ROUND(B215*'Base Values'!$B$16,0))","v":""},{"$f":"IF(LEN(B215)=0,\"\",ROUND(E215/2000*'Base Values'!$B$10,0))","v":""},"",{"$f":"IF(OR(LEN(B215)=0,LEN(C215)=0),\"\",ROUND(B215/(C215/100)*'Base Values'!$B$12/100,0))","v":""},{"$f":"IF(LEN(B215)=0,\"\",ROUND(B215*'Base Values'!$B$14,0))","v":""},""]
[{"$f":"IF(LEN('HVI Quality Data'!A216)>0,'HVI Quality Data'!A216,\"\")","v":""},null,null,{"$f":"IF(LEN(B216)=0,\"\",ROUND($B216*'HVI Quality Data'!R216/100,0))","v":""},{"$f":"IF(LEN(B216)=0,\"\",ROUND(B216*'Base Values'!$B$16,0))","v":""},{"$f":"IF(LEN(B216)=0,\"\",ROUND(E216/2000*'Base Values'!$B$10,0))","v":""},"",{"$f":"IF(OR(LEN(B216)=0,LEN(C216)=0),\"\",ROUND(B216/(C216/100)*'Base Values'!$B$12/100,0))","v":""},{"$f":"IF(LEN(B216)=0,\"\",ROUND(B216*'Base Values'!$B$14,0))","v":""},""]
[{"$f":"IF(LEN('HVI Quality Data'!A217)>0,'HVI Quality Data'!A217,\"\")","v":""},null,null,{"$f":"IF(LEN(B217)=0,\"\",ROUND($B217*'HVI Quality Data'!R217/100,0))","v":""},{"$f":"IF(LEN(B217)=0,\"\",ROUND(B217*'Base Values'!$B$16,0))","v":""},{"$f":"IF(LEN(B217)=0,\"\",ROUND(E217/2000*'Base Values'!$B$10,0))","v":""},"",{"$f":"IF(OR(LEN(B217)=0,LEN(C217)=0),\"\",ROUND(B217/(C217/100)*'Base Values'!$B$12/100,0))","v":""},{"$f":"IF(LEN(B217)=0,\"\",ROUND(B217*'Base Values'!$B$14,0))","v":""},""]
[{"$f":"IF(LEN('HVI Quality Data'!A218)>0,'HVI Quality Data'!A218,\"\")","v":""},null,null,{"$f":"IF(LEN(B218)=0,\"\",ROUND($B218*'HVI Quality Data'!R218/100,0))","v":""},{"$f":"IF(LEN(B218)=0,\"\",ROUND(B218*'Base Values'!$B$16,0))","v":""},{"$f":"IF(LEN(B218)=0,\"\",ROUND(E218/2000*'Base Values'!$B$10,0))","v":""},"",{"$f":"IF(OR(LEN(B218)=0,LEN(C218)=0),\"\",ROUND(B218/(C218/100)*'Base Values'!$B$12/100,0))","v":""},{"$f":"IF(LEN(B218)=0,\"\",ROUND(B218*'Base Values'!$B$14,0))","v":""},""]
[{"$f":"IF(LEN('HVI Quality Data'!A219)>0,'HVI Quality Data'!A219,\"\")","v":""},null,null,{"$f":"IF(LEN(B219)=0,\"\",ROUND($B219*'HVI Quality Data'!R219/100,0))","v":""},{"$f":"IF(LEN(B219)=0,\"\",ROUND(B219*'Base Values'!$B$16,0))","v":""},{"$f":"IF(LEN(B219)=0,\"\",ROUND(E219/2000*'Base Values'!$B$10,0))","v":""},"",{"$f":"IF(OR(LEN(B219)=0,LEN(C219)=0),\"\",ROUND(B219/(C219/100)*'Base Values'!$B$12/100,0))","v":""},{"$f":"IF(LEN(B219)=0,\"\",ROUND(B219*'Base Values'!$B$14,0))","v":""},""]
[{"$f":"IF(LEN('HVI Quality Data'!A220)>0,'HVI Quality Data'!A220,\"\")","v":""},null,null,{"$f":"IF(LEN(B220)=0,\"\",ROUND($B220*'HVI Quality Data'!R220/100,0))","v":""},{"$f":"IF(LEN(B220)=0,\"\",ROUND(B220*'Base Values'!$B$16,0))","v":""},{"$f":"IF(LEN(B220)=0,\"\",ROUND(E220/2000*'Base Values'!$B$10,0))","v":""},"",{"$f":"IF(OR(LEN(B220)=0,LEN(C220)=0),\"\",ROUND(B220/(C220/100)*'Base Values'!$B$12/100,0))","v":""},{"$f":"IF(LEN(B220)=0,\"\",ROUND(B220*'Base Values'!$B$14,0))","v":""},""]
[{"$f":"IF(LEN('HVI Quality Data'!A221)>0,'HVI Quality Data'!A221,\"\")","v":""},null,null,{"$f":"IF(LEN(B221)=0,\"\",ROUND($B221*'HVI Quality Data'!R221/100,0))","v":""},{"$f":"IF(LEN(B221)=0,\"\",ROUND(B221*'Base Values'!$B$16,0))","v":""},{"$f":"IF(LEN(B221)=0,\"\",ROUND(E221/2000*'Base Values'!$B$10,0))","v":""},"",{"$f":"IF(OR(LEN(B221)=0,LEN(C221)=0),\"\",ROUND(B221/(C221/100)*'Base Values'!$B$12/100,0))","v":""},{"$f":"IF(LEN(B221)=0,\"\",ROUND(B221*'Base Values'!$B$14,0))","v":""},""]
[{"$f":"IF(LEN('HVI Quality Data'!A222)>0,'HVI Quality Data'!A222,\"\")","v":""},null,null,{"$f":"IF(LEN(B222)=0,\"\",ROUND($B222*'HVI Quality Data'!R222/100,0))","v":""},{"$f":"IF(LEN(B222)=0,\"\",ROUND(B222*'Base Values'!$B$16,0))","v":""},{"$f":"IF(LEN(B222)=0,\"\",ROUND(E222/2000*'Base Values'!$B$10,0))","v":""},"",{"$f":"IF(OR(LEN(B222)=0,LEN(C222)=0),\"\",ROUND(B222/(C222/100)*'Base Values'!$B$12/100,0))","v":""},{"$f":"IF(LEN(B222)=0,\"\",ROUND(B222*'Base Values'!$B$14,0))","v":""},""]
[{"$f":"IF(LEN('HVI Quality Data'!A223)>0,'HVI Quality Data'!A223,\"\")","v":""},null,null,{"$f":"IF(LEN(B223)=0,\"\",ROUND($B223*'HVI Quality Data'!R223/100,0))","v":""},{"$f":"IF(LEN(B223)=0,\"\",ROUND(B223*'Base Values'!$B$16,0))","v":""},{"$f":"IF(LEN(B223)=0,\"\",ROUND(E223/2000*'Base Values'!$B$10,0))","v":""},"",{"$f":"IF(OR(LEN(B223)=0,LEN(C223)=0),\"\",ROUND(B223/(C223/100)*'Base Values'!$B$12/100,0))","v":""},{"$f":"IF(LEN(B223)=0,\"\",ROUND(B223*'Base Values'!$B$14,0))","v":""},""]
[{"$f":"IF(LEN('HVI Quality Data'!A224)>0,'HVI Quality Data'!A224,\"\")","v":""},null,null,{"$f":"IF(LEN(B224)=0,\"\",ROUND($B224*'HVI Quality Data'!R224/100,0))","v":""},{"$f":"IF(LEN(B224)=0,\"\",ROUND(B224*'Base Values'!$B$16,0))","v":""},{"$f":"IF(LEN(B224)=0,\"\",ROUND(E224/2000*'Base Values'!$B$10,0))","v":""},"",{"$f":"IF(OR(LEN(B224)=0,LEN(C224)=0),\"\",ROUND(B224/(C224/100)*'Base Values'!$B$12/100,0))","v":""},{"$f":"IF(LEN(B224)=0,\"\",ROUND(B224*'Base Values'!$B$14,0))","v":""},""]
[{"$f":"IF(LEN('HVI Quality Data'!A225)>0,'HVI Quality Data'!A225,\"\")","v":""},null,null,{"$f":"IF(LEN(B225)=0,\"\",ROUND($B225*'HVI Quality Data'!R225/100,0))","v":""},{"$f":"IF(LEN(B225)=0,\"\",ROUND(B225*'Base Values'!$B$16,0))","v":""},{"$f":"IF(LEN(B225)=0,\"\",ROUND(E225/2000*'Base Values'!$B$10,0))","v":""},"",{"$f":"IF(OR(LEN(B225)=0,LEN(C225)=0),\"\",ROUND(B225/(C225/100)*'Base Values'!$B$12/100,0))","v":""},{"$f":"IF(LEN(B225)=0,\"\",ROUND(B225*'Base Values'!$B$14,0))","v":""},""]
[{"$f":"IF(LEN('HVI Quality Data'!A226)>0,'HVI Quality Data'!A226,\"\")","v":""},null,null,{"$f":"IF(LEN(B226)=0,\"\",ROUND($B226*'HVI Quality Data'!R226/100,0))","v":""},{"$f":"IF(LEN(B226)=0,\"\",ROUND(B226*'Base Values'!$B$16,0))","v":""},{"$f":"IF(LEN(B226)=0,\"\",ROUND(E226/2000*'Base Values'!$B$10,0))","v":""},"",{"$f":"IF(OR(LEN(B226)=0,LEN(C226)=0),\"\",ROUND(B226/(C226/100)*'Base Values'!$B$12/100,0))","v":""},{"$f":"IF(LEN(B226)=0,\"\",ROUND(B226*'Base Values'!$B$14,0))","v":""},""]
[{"$f":"IF(LEN('HVI Quality Data'!A227)>0,'HVI Quality Data'!A227,\"\")","v":""},null,null,{"$f":"IF(LEN(B227)=0,\"\",ROUND($B227*'HVI Quality Data'!R227/100,0))","v":""},{"$f":"IF(LEN(B227)=0,\"\",ROUND(B227*'Base Values'!$B$16,0))","v":""},{"$f":"IF(LEN(B227)=0,\"\",ROUND(E227/2000*'Base Values'!$B$10,0))","v":""},"",{"$f":"IF(OR(LEN(B227)=0,LEN(C227)=0),\"\",ROUND(B227/(C227/100)*'Base Values'!$B$12/100,0))","v":""},{"$f":"IF(LEN(B227)=0,\"\",ROUND(B227*'Base Values'!$B$14,0))","v":""},""]
[{"$f":"IF(LEN('HVI Quality Data'!A228)>0,'HVI Quality Data'!A228,\"\")","v":""},null,null,{"$f":"IF(LEN(B228)=0,\"\",ROUND($B228*'HVI Quality Data'!R228/100,0))","v":""},{"$f":"IF(LEN(B228)=0,\"\",ROUND(B228*'Base Values'!$B$16,0))","v":""},{"$f":"IF(LEN(B228)=0,\"\",ROUND(E228/2000*'Base Values'!$B$10,0))","v":""},"",{"$f":"IF(OR(LEN(B228)=0,LEN(C228)=0),\"\",ROUND(B228/(C228/100)*'Base Values'!$B$12/100,0))","v":""},{"$f":"IF(LEN(B228)=0,\"\",ROUND(B228*'Base Values'!$B$14,0))","v":""},""]
[{"$f":"IF(LEN('HVI Quality Data'!A229)>0,'HVI Quality Data'!A229,\"\")","v":""},null,null,{"$f":"IF(LEN(B229)=0,\"\",ROUND($B229*'HVI Quality Data'!R229/100,0))","v":""},{"$f":"IF(LEN(B229)=0,\"\",ROUND(B229*'Base Values'!$B$16,0))","v":""},{"$f":"IF(LEN(B229)=0,\"\",ROUND(E229/2000*'Base Values'!$B$10,0))","v":""},"",{"$f":"IF(OR(LEN(B229)=0,LEN(C229)=0),\"\",ROUND(B229/(C229/100)*'Base Values'!$B$12/100,0))","v":""},{"$f":"IF(LEN(B229)=0,\"\",ROUND(B229*'Base Values'!$B$14,0))","v":""},""]
[{"$f":"IF(LEN('HVI Quality Data'!A230)>0,'HVI Quality Data'!A230,\"\")","v":""},null,null,{"$f":"IF(LEN(B230)=0,\"\",ROUND($B230*'HVI Quality Data'!R230/100,0))","v":""},{"$f":"IF(LEN(B230)=0,\"\",ROUND(B230*'Base Values'!$B$16,0))","v":""},{"$f":"IF(LEN(B230)=0,\"\",ROUND(E230/2000*'Base Values'!$B$10,0))","v":""},"",{"$f":"IF(OR(LEN(B230)=0,LEN(C230)=0),\"\",ROUND(B230/(C230/100)*'Base Values'!$B$12/100,0))","v":""},{"$f":"IF(LEN(B230)=0,\"\",ROUND(B230*'Base Values'!$B$14,0))","v":""},""]
[{"$f":"IF(LEN('HVI Quality Data'!A231)>0,'HVI Quality Data'!A231,\"\")","v":""},null,null,{"$f":"IF(LEN(B231)=0,\"\",ROUND($B231*'HVI Quality Data'!R231/100,0))","v":""},{"$f":"IF(LEN(B231)=0,\"\",ROUND(B231*'Base Values'!$B$16,0))","v":""},{"$f":"IF(LEN(B231)=0,\"\",ROUND(E231/2000*'Base Values'!$B$10,0))","v":""},"",{"$f":"IF(OR(LEN(B231)=0,LEN(C231)=0),\"\",ROUND(B231/(C231/100)*'Base Values'!$B$12/100,0))","v":""},{"$f":"IF(LEN(B231)=0,\"\",ROUND(B231*'Base Values'!$B$14,0))","v":""},""]
[{"$f":"IF(LEN('HVI Quality Data'!A232)>0,'HVI Quality Data'!A232,\"\")","v":""},null,null,{"$f":"IF(LEN(B232)=0,\"\",ROUND($B232*'HVI Quality Data'!R232/100,0))","v":""},{"$f":"IF(LEN(B232)=0,\"\",ROUND(B232*'Base Values'!$B$16,0))","v":""},{"$f":"IF(LEN(B232)=0,\"\",ROUND(E232/2000*'Base Values'!$B$10,0))","v":""},"",{"$f":"IF(OR(LEN(B232)=0,LEN(C232)=0),\"\",ROUND(B232/(C232/100)*'Base Values'!$B$12/100,0))","v":""},{"$f":"IF(LEN(B232)=0,\"\",ROUND(B232*'Base Values'!$B$14,0))","v":""},""]
[{"$f":"IF(LEN('HVI Quality Data'!A233)>0,'HVI Quality Data'!A233,\"\")","v":""},null,null,{"$f":"IF(LEN(B233)=0,\"\",ROUND($B233*'HVI Quality Data'!R233/100,0))","v":""},{"$f":"IF(LEN(B233)=0,\"\",ROUND(B233*'Base Values'!$B$16,0))","v":""},{"$f":"IF(LEN(B233)=0,\"\",ROUND(E233/2000*'Base Values'!$B$10,0))","v":""},"",{"$f":"IF(OR(LEN(B233)=0,LEN(C233)=0),\"\",ROUND(B233/(C233/100)*'Base Values'!$B$12/100,0))","v":""},{"$f":"IF(LEN(B233)=0,\"\",ROUND(B233*'Base Values'!$B$14,0))","v":""},""]
[{"$f":"IF(LEN('HVI Quality Data'!A234)>0,'HVI Quality Data'!A234,\"\")","v":""},null,null,{"$f":"IF(LEN(B234)=0,\"\",ROUND($B234*'HVI Quality Data'!R234/100,0))","v":""},{"$f":"IF(LEN(B234)=0,\"\",ROUND(B234*'Base Values'!$B$16,0))","v":""},{"$f":"IF(LEN(B234)=0,\"\",ROUND(E234/2000*'Base Values'!$B$10,0))","v":""},"",{"$f":"IF(OR(LEN(B234)=0,LEN(C234)=0),\"\",ROUND(B234/(C234/100)*'Base Values'!$B$12/100,0))","v":""},{"$f":"IF(LEN(B234)=0,\"\",ROUND(B234*'Base Values'!$B$14,0))","v":""},""]
[{"$f":"IF(LEN('HVI Quality Data'!A235)>0,'HVI Quality Data'!A235,\"\")","v":""},null,null,{"$f":"IF(LEN(B235)=0,\"\",ROUND($B235*'HVI Quality Data'!R235/100,0))","v":""},{"$f":"IF(LEN(B235)=0,\"\",ROUND(B235*'Base Values'!$B$16,0))","v":""},{"$f":"IF(LEN(B235)=0,\"\",ROUND(E235/2000*'Base Values'!$B$10,0))","v":""},"",{"$f":"IF(OR(LEN(B235)=0,LEN(C235)=0),\"\",ROUND(B235/(C235/100)*'Base Values'!$B$12/100,0))","v":""},{"$f":"IF(LEN(B235)=0,\"\",ROUND(B235*'Base Values'!$B$14,0))","v":""},""]
[{"$f":"IF(LEN('HVI Quality Data'!A236)>0,'HVI Quality Data'!A236,\"\")","v":""},null,null,{"$f":"IF(LEN(B236)=0,\"\",ROUND($B236*'HVI Quality Data'!R236/100,0))","v":""},{"$f":"IF(LEN(B236)=0,\"\",ROUND(B236*'Base Values'!$B$16,0))","v":""},{"$f":"IF(LEN(B236)=0,\"\",ROUND(E236/2000*'Base Values'!$B$10,0))","v":""},"",{"$f":"IF(OR(LEN(B236)=0,LEN(C236)=0),\"\",ROUND(B236/(C236/100)*'Base Values'!$B$12/100,0))","v":""},{"$f":"IF(LEN(B236)=0,\"\",ROUND(B236*'Base Values'!$B$14,0))","v":""},""]
[{"$f":"IF(LEN('HVI Quality Data'!A237)>0,'HVI Quality Data'!A237,\"\")","v":""},null,null,{"$f":"IF(LEN(B237)=0,\"\",ROUND($B237*'HVI Quality Data'!R237/100,0))","v":""},{"$f":"IF(LEN(B237)=0,\"\",ROUND(B237*'Base Values'!$B$16,0))","v":""},{"$f":"IF(LEN(B237)=0,\"\",ROUND(E237/2000*'Base Values'!$B$10,0))","v":""},"",{"$f":"IF(OR(LEN(B237)=0,LEN(C237)=0),\"\",ROUND(B237/(C237/100)*'Base Values'!$B$12/100,0))","v":""},{"$f":"IF(LEN(B237)=0,\"\",ROUND(B237*'Base Values'!$B$14,0))","v":""},""]
[{"$f":"IF(LEN('HVI Quality Data'!A238)>0,'HVI Quality Data'!A238,\"\")","v":""},null,null,{"$f":"IF(LEN(B238)=0,\"\",ROUND($B238*'HVI Quality Data'!R238/100,0))","v":""},{"$f":"IF(LEN(B238)=0,\"\",ROUND(B238*'Base Values'!$B$16,0))","v":""},{"$f":"IF(LEN(B238)=0,\"\",ROUND(E238/2000*'Base Values'!$B$10,0))","v":""},"",{"$f":"IF(OR(LEN(B238)=0,LEN(C238)=0),\"\",ROUND(B238/(C238/100)*'Base Values'!$B$12/100,0))","v":""},{"$f":"IF(LEN(B238)=0,\"\",ROUND(B238*'Base Values'!$B$14,0))","v":""},""]
[{"$f":"IF(LEN('HVI Quality Data'!A239)>0,'HVI Quality Data'!A239,\"\")","v":""},null,null,{"$f":"IF(LEN(B239)=0,\"\",ROUND($B239*'HVI Quality Data'!R239/100,0))","v":""},{"$f":"IF(LEN(B239)=0,\"\",ROUND(B239*'Base Values'!$B$16,0))","v":""},{"$f":"IF(LEN(B239)=0,\"\",ROUND(E239/2000*'Base Values'!$B$10,0))","v":""},"",{"$f":"IF(OR(LEN(B239)=0,LEN(C239)=0),\"\",ROUND(B239/(C239/100)*'Base Values'!$B$12/100,0))","v":""},{"$f":"IF(LEN(B239)=0,\"\",ROUND(B239*'Base Values'!$B$14,0))","v":""},""]
[{"$f":"IF(LEN('HVI Quality Data'!A240)>0,'HVI Quality Data'!A240,\"\")","v":""},null,null,{"$f":"IF(LEN(B240)=0,\"\",ROUND($B240*'HVI Quality Data'!R240/100,0))","v":""},{"$f":"IF(LEN(B240)=0,\"\",ROUND(B240*'Base Values'!$B$16,0))","v":""},{"$f":"IF(LEN(B240)=0,\"\",ROUND(E240/2000*'Base Values'!$B$10,0))","v":""},"",{"$f":"IF(OR(LEN(B240)=0,LEN(C240)=0),\"\",ROUND(B240/(C240/100)*'Base Values'!$B$12/100,0))","v":""},{"$f":"IF(LEN(B240)=0,\"\",ROUND(B240*'Base Values'!$B$14,0))","v":""},""]
[{"$f":"IF(LEN('HVI Quality Data'!A241)>0,'HVI Quality Data'!A241,\"\")","v":""},null,null,{"$f":"IF(LEN(B241)=0,\"\",ROUND($B241*'HVI Quality Data'!R241/100,0))","v":""},{"$f":"IF(LEN(B241)=0,\"\",ROUND(B241*'Base Values'!$B$16,0))","v":""},{"$f":"IF(LEN(B241)=0,\"\",ROUND(E241/2000*'Base Values'!$B$10,0))","v":""},"",{"$f":"IF(OR(LEN(B241)=0,LEN(C241)=0),\"\",ROUND(B241/(C241/100)*'Base Values'!$B$12/100,0))","v":""},{"$f":"IF(LEN(B241)=0,\"\",ROUND(B241*'Base Values'!$B$14,0))","v":""},""]
[{"$f":"IF(LEN('HVI Quality Data'!A242)>0,'HVI Quality Data'!A242,\"\")","v":""},null,null,{"$f":"IF(LEN(B242)=0,\"\",ROUND($B242*'HVI Quality Data'!R242/100,0))","v":""},{"$f":"IF(LEN(B242)=0,\"\",ROUND(B242*'Base Values'!$B$16,0))","v":""},{"$f":"IF(LEN(B242)=0,\"\",ROUND(E242/2000*'Base Values'!$B$10,0))","v":""},"",{"$f":"IF(OR(LEN(B242)=0,LEN(C242)=0),\"\",ROUND(B242/(C242/100)*'Base Values'!$B$12/100,0))","v":""},{"$f":"IF(LEN(B242)=0,\"\",ROUND(B242*'Base Values'!$B$14,0))","v":""},""]
[{"$f":"IF(LEN('HVI Quality Data'!A243)>0,'HVI Quality Data'!A243,\"\")","v":""},null,null,{"$f":"IF(LEN(B243)=0,\"\",ROUND($B243*'HVI Quality Data'!R243/100,0))","v":""},{"$f":"IF(LEN(B243)=0,\"\",ROUND(B243*'Base Values'!$B$16,0))","v":""},{"$f":"IF(LEN(B243)=0,\"\",ROUND(E243/2000*'Base Values'!$B$10,0))","v":""},"",{"$f":"IF(OR(LEN(B243)=0,LEN(C243)=0),\"\",ROUND(B243/(C243/100)*'Base Values'!$B$12/100,0))","v":""},{"$f":"IF(LEN(B243)=0,\"\",ROUND(B243*'Base Values'!$B$14,0))","v":""},""]
[{"$f":"IF(LEN('HVI Quality Data'!A244)>0,'HVI Quality Data'!A244,\"\")","v":""},null,null,{"$f":"IF(LEN(B244)=0,\"\",ROUND($B244*'HVI Quality Data'!R244/100,0))","v":""},{"$f":"IF(LEN(B244)=0,\"\",ROUND(B244*'Base Values'!$B$16,0))","v":""},{"$f":"IF(LEN(B244)=0,\"\",ROUND(E244/2000*'Base Values'!$B$10,0))","v":""},"",{"$f":"IF(OR(LEN(B244)=0,LEN(C244)=0),\"\",ROUND(B244/(C244/100)*'Base Values'!$B$12/100,0))","v":""},{"$f":"IF(LEN(B244)=0,\"\",ROUND(B244*'Base Values'!$B$14,0))","v":""},""]
[{"$f":"IF(LEN('HVI Quality Data'!A245)>0,'HVI Quality Data'!A245,\"\")","v":""},null,null,{"$f":"IF(LEN(B245)=0,\"\",ROUND($B245*'HVI Quality Data'!R245/100,0))","v":""},{"$f":"IF(LEN(B245)=0,\"\",ROUND(B245*'Base Values'!$B$16,0))","v":""},{"$f":"IF(LEN(B245)=0,\"\",ROUND(E245/2000*'Base Values'!$B$10,0))","v":""},"",{"$f":"IF(OR(LEN(B245)=0,LEN(C245)=0),\"\",ROUND(B245/(C245/100)*'Base Values'!$B$12/100,0))","v":""},{"$f":"IF(LEN(B245)=0,\"\",ROUND(B245*'Base Values'!$B$14,0))","v":""},""]
[{"$f":"IF(LEN('HVI Quality Data'!A246)>0,'HVI Quality Data'!A246,\"\")","v":""},null,null,{"$f":"IF(LEN(B246)=0,\"\",ROUND($B246*'HVI Quality Data'!R246/100,0))","v":""},{"$f":"IF(LEN(B246)=0,\"\",ROUND(B246*'Base Values'!$B$16,0))","v":""},{"$f":"IF(LEN(B246)=0,\"\",ROUND(E246/2000*'Base Values'!$B$10,0))","v":""},"",{"$f":"IF(OR(LEN(B246)=0,LEN(C246)=0),\"\",ROUND(B246/(C246/100)*'Base Values'!$B$12/100,0))","v":""},{"$f":"IF(LEN(B246)=0,\"\",ROUND(B246*'Base Values'!$B$14,0))","v":""},""]
[{"$f":"IF(LEN('HVI Quality Data'!A247)>0,'HVI Quality Data'!A247,\"\")","v":""},null,null,{"$f":"IF(LEN(B247)=0,\"\",ROUND($B247*'HVI Quality Data'!R247/100,0))","v":""},{"$f":"IF(LEN(B247)=0,\"\",ROUND(B247*'Base Values'!$B$16,0))","v":""},{"$f":"IF(LEN(B247)=0,\"\",ROUND(E247/2000*'Base Values'!$B$10,0))","v":""},"",{"$f":"IF(OR(LEN(B247)=0,LEN(C247)=0),\"\",ROUND(B247/(C247/100)*'Base Values'!$B$12/100,0))","v":""},{"$f":"IF(LEN(B247)=0,\"\",ROUND(B247*'Base Values'!$B$14,0))","v":""},""]
[{"$f":"IF(LEN('HVI Quality Data'!A248)>0,'HVI Quality Data'!A248,\"\")","v":""},null,null,{"$f":"IF(LEN(B248)=0,\"\",ROUND($B248*'HVI Quality Data'!R248/100,0))","v":""},{"$f":"IF(LEN(B248)=0,\"\",ROUND(B248*'Base Values'!$B$16,0))","v":""},{"$f":"IF(LEN(B248)=0,\"\",ROUND(E248/2000*'Base Values'!$B$10,0))","v":""},"",{"$f":"IF(OR(LEN(B248)=0,LEN(C248)=0),\"\",ROUND(B248/(C248/100)*'Base Values'!$B$12/100,0))","v":""},{"$f":"IF(LEN(B248)=0,\"\",ROUND(B248*'Base Values'!$B$14,0))","v":""},""]
[{"$f":"IF(LEN('HVI Quality Data'!A249)>0,'HVI Quality Data'!A249,\"\")","v":""},null,null,{"$f":"IF(LEN(B249)=0,\"\",ROUND($B249*'HVI Quality Data'!R249/100,0))","v":""},{"$f":"IF(LEN(B249)=0,\"\",ROUND(B249*'Base Values'!$B$16,0))","v":""},{"$f":"IF(LEN(B249)=0,\"\",ROUND(E249/2000*'Base Values'!$B$10,0))","v":""},"",{"$f":"IF(OR(LEN(B249)=0,LEN(C249)=0),\"\",ROUND(B249/(C249/100)*'Base Values'!$B$12/100,0))","v":""},{"$f":"IF(LEN(B249)=0,\"\",ROUND(B249*'Base Values'!$B$14,0))","v":""},""]
[{"$f":"IF(LEN('HVI Quality Data'!A250)>0,'HVI Quality Data'!A250,\"\")","v":""},null,null,{"$f":"IF(LEN(B250)=0,\"\",ROUND($B250*'HVI Quality Data'!R250/100,0))","v":""},{"$f":"IF(LEN(B250)=0,\"\",ROUND(B250*'Base Values'!$B$16,0))","v":""},{"$f":"IF(LEN(B250)=0,\"\",ROUND(E250/2000*'Base Values'!$B$10,0))","v":""},"",{"$f":"IF(OR(LEN(B250)=0,LEN(C250)=0),\"\",ROUND(B250/(C250/100)*'Base Values'!$B$12/100,0))","v":""},{"$f":"IF(LEN(B250)=0,\"\",ROUND(B250*'Base Values'!$B$14,0))","v":""},""]
[{"$f":"IF(LEN('HVI Quality Data'!A251)>0,'HVI Quality Data'!A251,\"\")","v":""},null,null,{"$f":"IF(LEN(B251)=0,\"\",ROUND($B251*'HVI Quality Data'!R251/100,0))","v":""},{"$f":"IF(LEN(B251)=0,\"\",ROUND(B251*'Base Values'!$B$16,0))","v":""},{"$f":"IF(LEN(B251)=0,\"\",ROUND(E251/2000*'Base Values'!$B$10,0))","v":""},"",{"$f":"IF(OR(LEN(B251)=0,LEN(C251)=0),\"\",ROUND(B251/(C251/100)*'Base Values'!$B$12/100,0))","v":""},{"$f":"IF(LEN(B251)=0,\"\",ROUND(B251*'Base Values'!$B$14,0))","v":""},""]
[{"$f":"IF(LEN('HVI Quality Data'!A252)>0,'HVI Quality Data'!A252,\"\")","v":""},null,null,{"$f":"IF(LEN(B252)=0,\"\",ROUND($B252*'HVI Quality Data'!R252/100,0))","v":""},{"$f":"IF(LEN(B252)=0,\"\",ROUND(B252*'Base Values'!$B$16,0))","v":""},{"$f":"IF(LEN(B252)=0,\"\",ROUND(E252/2000*'Base Values'!$B$10,0))","v":""},"",{"$f":"IF(OR(LEN(B252)=0,LEN(C252)=0),\"\",ROUND(B252/(C252/100)*'Base Values'!$B$12/100,0))","v":""},{"$f":"IF(LEN(B252)=0,\"\",ROUND(B252*'Base Values'!$B$14,0))","v":""},""]
[{"$f":"IF(LEN('HVI Quality Data'!A253)>0,'HVI Quality Data'!A253,\"\")","v":""},null,null,{"$f":"IF(LEN(B253)=0,\"\",ROUND($B253*'HVI Quality Data'!R253/100,0))","v":""},{"$f":"IF(LEN(B253)=0,\"\",ROUND(B253*'Base Values'!$B$16,0))","v":""},{"$f":"IF(LEN(B253)=0,\"\",ROUND(E253/2000*'Base Values'!$B$10,0))","v":""},"",{"$f":"IF(OR(LEN(B253)=0,LEN(C253)=0),\"\",ROUND(B253/(C253/100)*'Base Values'!$B$12/100,0))","v":""},{"$f":"IF(LEN(B253)=0,\"\",ROUND(B253*'Base Values'!$B$14,0))","v":""},""]
[{"$f":"IF(LEN('HVI Quality Data'!A254)>0,'HVI Quality Data'!A254,\"\")","v":""},null,null,{"$f":"IF(LEN(B254)=0,\"\",ROUND($B254*'HVI Quality Data'!R254/100,0))","v":""},{"$f":"IF(LEN(B254)=0,\"\",ROUND(B254*'Base Values'!$B$16,0))","v":""},{"$f":"IF(LEN(B254)=0,\"\",ROUND(E254/2000*'Base Values'!$B$10,0))","v":""},"",{"$f":"IF(OR(LEN(B254)=0,LEN(C254)=0),\"\",ROUND(B254/(C254/100)*'Base Values'!$B$12/100,0))","v":""},{"$f":"IF(LEN(B254)=0,\"\",ROUND(B254*'Base Values'!$B$14,0))","v":""},""]
[{"$f":"IF(LEN('HVI Quality Data'!A255)>0,'HVI Quality Data'!A255,\"\")","v":""},null,null,{"$f":"IF(LEN(B255)=0,\"\",ROUND($B255*'HVI Quality Data'!R255/100,0))","v":""},{"$f":"IF(LEN(B255)=0,\"\",ROUND(B255*'Base Values'!$B$16,0))","v":""},{"$f":"IF(LEN(B255)=0,\"\",ROUND(E255/2000*'Base Values'!$B$10,0))","v":""},"",{"$f":"IF(OR(LEN(B255)=0,LEN(C255)=0),\"\",ROUND(B255/(C255/100)*'Base Values'!$B$12/100,0))","v":""},{"$f":"IF(LEN(B255)=0,\"\",ROUND(B255*'Base Values'!$B$14,0))","v":""},""]
[{"$f":"IF(LEN('HVI Quality Data'!A256)>0,'HVI Quality Data'!A256,\"\")","v":""},null,null,{"$f":"IF(LEN(B256)=0,\"\",ROUND($B256*'HVI Quality Data'!R256/100,0))","v":""},{"$f":"IF(LEN(B256)=0,\"\",ROUND(B256*'Base Values'!$B$16,0))","v":""},{"$f":"IF(LEN(B256)=0,\"\",ROUND(E256/2000*'Base Values'!$B$10,0))","v":""},"",{"$f":"IF(OR(LEN(B256)=0,LEN(C256)=0),\"\",ROUND(B256/(C256/100)*'Base Values'!$B$12/100,0))","v":""},{"$f":"IF(LEN(B256)=0,\"\",ROUND(B256*'Base Values'!$B$14,0))","v":""},""]
[{"$f":"IF(LEN('HVI Quality Data'!A257)>0,'HVI Quality Data'!A257,\"\")","v":""},null,null,{"$f":"IF(LEN(B257)=0,\"\",ROUND($B257*'HVI Quality Data'!R257/100,0))","v":""},{"$f":"IF(LEN(B257)=0,\"\",ROUND(B257*'Base Values'!$B$16,0))","v":""},{"$f":"IF(LEN(B257)=0,\"\",ROUND(E257/2000*'Base Values'!$B$10,0))","v":""},"",{"$f":"IF(OR(LEN(B257)=0,LEN(C257)=0),\"\",ROUND(B257/(C257/100)*'Base Values'!$B$12/100,0))","v":""},{"$f":"IF(LEN(B257)=0,\"\",ROUND(B257*'Base Values'!$B$14,0))","v":""},""]
[{"$f":"IF(LEN('HVI Quality Data'!A258)>0,'HVI Quality Data'!A258,\"\")","v":""},null,null,{"$f":"IF(LEN(B258)=0,\"\",ROUND($B258*'HVI Quality Data'!R258/100,0))","v":""},{"$f":"IF(LEN(B258)=0,\"\",ROUND(B258*'Base Values'!$B$16,0))","v":""},{"$f":"IF(LEN(B258)=0,\"\",ROUND(E258/2000*'Base Values'!$B$10,0))","v":""},"",{"$f":"IF(OR(LEN(B258)=0,LEN(C258)=0),\"\",ROUND(B258/(C258/100)*'Base Values'!$B$12/100,0))","v":""},{"$f":"IF(LEN(B258)=0,\"\",ROUND(B258*'Base Values'!$B$14,0))","v":""},""]
[{"$f":"IF(LEN('HVI Quality Data'!A259)>0,'HVI Quality Data'!A259,\"\")","v":""},null,null,{"$f":"IF(LEN(B259)=0,\"\",ROUND($B259*'HVI Quality Data'!R259/100,0))","v":""},{"$f":"IF(LEN(B259)=0,\"\",ROUND(B259*'Base Values'!$B$16,0))","v":""},{"$f":"IF(LEN(B259)=0,\"\",ROUND(E259/2000*'Base Values'!$B$10,0))","v":""},"",{"$f":"IF(OR(LEN(B259)=0,LEN(C259)=0),\"\",ROUND(B259/(C259/100)*'Base Values'!$B$12/100,0))","v":""},{"$f":"IF(LEN(B259)=0,\"\",ROUND(B259*'Base Values'!$B$14,0))","v":""},""]
[{"$f":"IF(LEN('HVI Quality Data'!A260)>0,'HVI Quality Data'!A260,\"\")","v":""},null,null,{"$f":"IF(LEN(B260)=0,\"\",ROUND($B260*'HVI Quality Data'!R260/100,0))","v":""},{"$f":"IF(LEN(B260)=0,\"\",ROUND(B260*'Base Values'!$B$16,0))","v":""},{"$f":"IF(LEN(B260)=0,\"\",ROUND(E260/2000*'Base Values'!$B$10,0))","v":""},"",{"$f":"IF(OR(LEN(B260)=0,LEN(C260)=0),\"\",ROUND(B260/(C260/100)*'Base Values'!$B$12/100,0))","v":""},{"$f":"IF(LEN(B260)=0,\"\",ROUND(B260*'Base Values'!$B$14,0))","v":""},""]
[{"$f":"IF(LEN('HVI Quality Data'!A261)>0,'HVI Quality Data'!A261,\"\")","v":""},null,null,{"$f":"IF(LEN(B261)=0,\"\",ROUND($B261*'HVI Quality Data'!R261/100,0))","v":""},{"$f":"IF(LEN(B261)=0,\"\",ROUND(B261*'Base Values'!$B$16,0))","v":""},{"$f":"IF(LEN(B261)=0,\"\",ROUND(E261/2000*'Base Values'!$B$10,0))","v":""},"",{"$f":"IF(OR(LEN(B261)=0,LEN(C261)=0),\"\",ROUND(B261/(C261/100)*'Base Values'!$B$12/100,0))","v":""},{"$f":"IF(LEN(B261)=0,\"\",ROUND(B261*'Base Values'!$B$14,0))","v":""},""]
[{"$f":"IF(LEN('HVI Quality Data'!A262)>0,'HVI Quality Data'!A262,\"\")","v":""},null,null,{"$f":"IF(LEN(B262)=0,\"\",ROUND($B262*'HVI Quality Data'!R262/100,0))","v":""},{"$f":"IF(LEN(B262)=0,\"\",ROUND(B262*'Base Values'!$B$16,0))","v":""},{"$f":"IF(LEN(B262)=0,\"\",ROUND(E262/2000*'Base Values'!$B$10,0))","v":""},"",{"$f":"IF(OR(LEN(B262)=0,LEN(C262)=0),\"\",ROUND(B262/(C262/100)*'Base Values'!$B$12/100,0))","v":""},{"$f":"IF(LEN(B262)=0,\"\",ROUND(B262*'Base Values'!$B$14,0))","v":""},""]
[{"$f":"IF(LEN('HVI Quality Data'!A263)>0,'HVI Quality Data'!A263,\"\")","v":""},null,null,{"$f":"IF(LEN(B263)=0,\"\",ROUND($B263*'HVI Quality Data'!R263/100,0))","v":""},{"$f":"IF(LEN(B263)=0,\"\",ROUND(B263*'Base Values'!$B$16,0))","v":""},{"$f":"IF(LEN(B263)=0,\"\",ROUND(E263/2000*'Base Values'!$B$10,0))","v":""},"",{"$f":"IF(OR(LEN(B263)=0,LEN(C263)=0),\"\",ROUND(B263/(C263/100)*'Base Values'!$B$12/100,0))","v":""},{"$f":"IF(LEN(B263)=0,\"\",ROUND(B263*'Base Values'!$B$14,0))","v":""},""]
[{"$f":"IF(LEN('HVI Quality Data'!A264)>0,'HVI Quality Data'!A264,\"\")","v":""},null,null,{"$f":"IF(LEN(B264)=0,\"\",ROUND($B264*'HVI Quality Data'!R264/100,0))","v":""},{"$f":"IF(LEN(B264)=0,\"\",ROUND(B264*'Base Values'!$B$16,0))","v":""},{"$f":"IF(LEN(B264)=0,\"\",ROUND(E264/2000*'Base Values'!$B$10,0))","v":""},"",{"$f":"IF(OR(LEN(B264)=0,LEN(C264)=0),\"\",ROUND(B264/(C264/100)*'Base Values'!$B$12/100,0))","v":""},{"$f":"IF(LEN(B264)=0,\"\",ROUND(B264*'Base Values'!$B$14,0))","v":""},""]
[{"$f":"IF(LEN('HVI Quality Data'!A265)>0,'HVI Quality Data'!A265,\"\")","v":""},null,null,{"$f":"IF(LEN(B265)=0,\"\",ROUND($B265*'HVI Quality Data'!R265/100,0))","v":""},{"$f":"IF(LEN(B265)=0,\"\",ROUND(B265*'Base Values'!$B$16,0))","v":""},{"$f":"IF(LEN(B265)=0,\"\",ROUND(E265/2000*'Base Values'!$B$10,0))","v":""},"",{"$f":"IF(OR(LEN(B265)=0,LEN(C265)=0),\"\",ROUND(B265/(C265/100)*'Base Values'!$B$12/100,0))","v":""},{"$f":"IF(LEN(B265)=0,\"\",ROUND(B265*'Base Values'!$B$14,0))","v":""},""]
[{"$f":"IF(LEN('HVI Quality Data'!A266)>0,'HVI Quality Data'!A266,\"\")","v":""},null,null,{"$f":"IF(LEN(B266)=0,\"\",ROUND($B266*'HVI Quality Data'!R266/100,0))","v":""},{"$f":"IF(LEN(B266)=0,\"\",ROUND(B266*'Base Values'!$B$16,0))","v":""},{"$f":"IF(LEN(B266)=0,\"\",ROUND(E266/2000*'Base Values'!$B$10,0))","v":""},"",{"$f":"IF(OR(LEN(B266)=0,LEN(C266)=0),\"\",ROUND(B266/(C266/100)*'Base Values'!$B$12/100,0))","v":""},{"$f":"IF(LEN(B266)=0,\"\",ROUND(B266*'Base Values'!$B$14,0))","v":""},""]
[{"$f":"IF(LEN('HVI Quality Data'!A267)>0,'HVI Quality Data'!A267,\"\")","v":""},null,null,{"$f":"IF(LEN(B267)=0,\"\",ROUND($B267*'HVI Quality Data'!R267/100,0))","v":""},{"$f":"IF(LEN(B267)=0,\"\",ROUND(B267*'Base Values'!$B$16,0))","v":""},{"$f":"IF(LEN(B267)=0,\"\",ROUND(E267/2000*'Base Values'!$B$10,0))","v":""},"",{"$f":"IF(OR(LEN(B267)=0,LEN(C267)=0),\"\",ROUND(B267/(C267/100)*'Base Values'!$B$12/100,0))","v":""},{"$f":"IF(LEN(B267)=0,\"\",ROUND(B267*'Base Values'!$B$14,0))","v":""},""]
[{"$f":"IF(LEN('HVI Quality Data'!A268)>0,'HVI Quality Data'!A268,\"\")","v":""},null,null,{"$f":"IF(LEN(B268)=0,\"\",ROUND($B268*'HVI Quality Data'!R268/100,0))","v":""},{"$f":"IF(LEN(B268)=0,\"\",ROUND(B268*'Base Values'!$B$16,0))","v":""},{"$f":"IF(LEN(B268)=0,\"\",ROUND(E268/2000*'Base Values'!$B$10,0))","v":""},"",{"$f":"IF(OR(LEN(B268)=0,LEN(C268)=0),\"\",ROUND(B268/(C268/100)*'Base Values'!$B$12/100,0))","v":""},{"$f":"IF(LEN(B268)=0,\"\",ROUND(B268*'Base Values'!$B$14,0))","v":""},""]
[{"$f":"IF(LEN('HVI Quality Data'!A269)>0,'HVI Quality Data'!A269,\"\")","v":""},null,null,{"$f":"IF(LEN(B269)=0,\"\",ROUND($B269*'HVI Quality Data'!R269/100,0))","v":""},{"$f":"IF(LEN(B269)=0,\"\",ROUND(B269*'Base Values'!$B$16,0))","v":""},{"$f":"IF(LEN(B269)=0,\"\",ROUND(E269/2000*'Base Values'!$B$10,0))","v":""},"",{"$f":"IF(OR(LEN(B269)=0,LEN(C269)=0),\"\",ROUND(B269/(C269/100)*'Base Values'!$B$12/100,0))","v":""},{"$f":"IF(LEN(B269)=0,\"\",ROUND(B269*'Base Values'!$B$14,0))","v":""},""]
[{"$f":"IF(LEN('HVI Quality Data'!A270)>0,'HVI Quality Data'!A270,\"\")","v":""},null,null,{"$f":"IF(LEN(B270)=0,\"\",ROUND($B270*'HVI Quality Data'!R270/100,0))","v":""},{"$f":"IF(LEN(B270)=0,\"\",ROUND(B270*'Base Values'!$B$16,0))","v":""},{"$f":"IF(LEN(B270)=0,\"\",ROUND(E270/2000*'Base Values'!$B$10,0))","v":""},"",{"$f":"IF(OR(LEN(B270)=0,LEN(C270)=0),\"\",ROUND(B270/(C270/100)*'Base Values'!$B$12/100,0))","v":""},{"$f":"IF(LEN(B270)=0,\"\",ROUND(B270*'Base Values'!$B$14,0))","v":""},""]
[{"$f":"IF(LEN('HVI Quality Data'!A271)>0,'HVI Quality Data'!A271,\"\")","v":""},null,null,{"$f":"IF(LEN(B271)=0,\"\",ROUND($B271*'HVI Quality Data'!R271/100,0))","v":""},{"$f":"IF(LEN(B271)=0,\"\",ROUND(B271*'Base Values'!$B$16,0))","v":""},{"$f":"IF(LEN(B271)=0,\"\",ROUND(E271/2000*'Base Values'!$B$10,0))","v":""},"",{"$f":"IF(OR(LEN(B271)=0,LEN(C271)=0),\"\",ROUND(B271/(C271/100)*'Base Values'!$B$12/100,0))","v":""},{"$f":"IF(LEN(B271)=0,\"\",ROUND(B271*'Base Values'!$B$14,0))","v":""},""]
[{"$f":"IF(LEN('HVI Quality Data'!A272)>0,'HVI Quality Data'!A272,\"\")","v":""},null,null,{"$f":"IF(LEN(B272)=0,\"\",ROUND($B272*'HVI Quality Data'!R272/100,0))","v":""},{"$f":"IF(LEN(B272)=0,\"\",ROUND(B272*'Base Values'!$B$16,0))","v":""},{"$f":"IF(LEN(B272)=0,\"\",ROUND(E272/2000*'Base Values'!$B$10,0))","v":""},{"$f":"IF(LEN(B272)=0,\"\",SUM(D272,F272))","v":""},{"$f":"IF(OR(LEN(B272)=0,LEN(C272)=0),\"\",ROUND(B272/(C272/100)*'Base Values'!$B$12/100,0))","v":""},{"$f":"IF(LEN(B272)=0,\"\",ROUND(B272*'Base Values'!$B$14,0))","v":""},{"$f":"IF(OR(LEN(B272)=0,LEN(C272)=0),\"\",G272-H272-I272)","v":""}]
[{"$f":"IF(LEN('HVI Quality Data'!A273)>0,'HVI Quality Data'!A273,\"\")","v":""},null,null,{"$f":"IF(LEN(B273)=0,\"\",ROUND($B273*'HVI Quality Data'!R273/100,0))","v":""},{"$f":"IF(LEN(B273)=0,\"\",ROUND(B273*'Base Values'!$B$16,0))","v":""},{"$f":"IF(LEN(B273)=0,\"\",ROUND(E273/2000*'Base Values'!$B$10,0))","v":""},"",{"$f":"IF(OR(LEN(B273)=0,LEN(C273)=0),\"\",ROUND(B273/(C273/100)*'Base Values'!$B$12/100,0))","v":""},{"$f":"IF(LEN(B273)=0,\"\",ROUND(B273*'Base Values'!$B$14,0))","v":""},""]
[{"$f":"IF(LEN('HVI Quality Data'!A274)>0,'HVI Quality Data'!A274,\"\")","v":""},null,null,{"$f":"IF(LEN(B274)=0,\"\",ROUND($B274*'HVI Quality Data'!R274/100,0))","v":""},{"$f":"IF(LEN(B274)=0,\"\",ROUND(B274*'Base Values'!$B$16,0))","v":""},{"$f":"IF(LEN(B274)=0,\"\",ROUND(E274/2000*'Base Values'!$B$10,0))","v":""},"",{"$f":"IF(OR(LEN(B274)=0,LEN(C274)=0),\"\",ROUND(B274/(C274/100)*'Base Values'!$B$12/100,0))","v":""},{"$f":"IF(LEN(B274)=0,\"\",ROUND(B274*'Base Values'!$B$14,0))","v":""},""]
[{"$f":"IF(LEN('HVI Quality Data'!A275)>0,'HVI Quality Data'!A275,\"\")","v":""},null,null,{"$f":"IF(LEN(B275)=0,\"\",ROUND($B275*'HVI Quality Data'!R275/100,0))","v":""},{"$f":"IF(LEN(B275)=0,\"\",ROUND(B275*'Base Values'!$B$16,0))","v":""},{"$f":"IF(LEN(B275)=0,\"\",ROUND(E275/2000*'Base Values'!$B$10,0))","v":""},"",{"$f":"IF(OR(LEN(B275)=0,LEN(C275)=0),\"\",ROUND(B275/(C275/100)*'Base Values'!$B$12/100,0))","v":""},{"$f":"IF(LEN(B275)=0,\"\",ROUND(B275*'Base Values'!$B$14,0))","v":""},""]
[{"$f":"IF(LEN('HVI Quality Data'!A276)>0,'HVI Quality Data'!A276,\"\")","v":""},null,null,{"$f":"IF(LEN(B276)=0,\"\",ROUND($B276*'HVI Quality Data'!R276/100,0))","v":""},{"$f":"IF(LEN(B276)=0,\"\",ROUND(B276*'Base Values'!$B$16,0))","v":""},{"$f":"IF(LEN(B276)=0,\"\",ROUND(E276/2000*'Base Values'!$B$10,0))","v":""},"",{"$f":"IF(OR(LEN(B276)=0,LEN(C276)=0),\"\",ROUND(B276/(C276/100)*'Base Values'!$B$12/100,0))","v":""},{"$f":"IF(LEN(B276)=0,\"\",ROUND(B276*'Base Values'!$B$14,0))","v":""},""]
[{"$f":"IF(LEN('HVI Quality Data'!A277)>0,'HVI Quality Data'!A277,\"\")","v":""},null,null,{"$f":"IF(LEN(B277)=0,\"\",ROUND($B277*'HVI Quality Data'!R277/100,0))","v":""},{"$f":"IF(LEN(B277)=0,\"\",ROUND(B277*'Base Values'!$B$16,0))","v":""},{"$f":"IF(LEN(B277)=0,\"\",ROUND(E277/2000*'Base Values'!$B$10,0))","v":""},"",{"$f":"IF(OR(LEN(B277)=0,LEN(C277)=0),\"\",ROUND(B277/(C277/100)*'Base Values'!$B$12/100,0))","v":""},{"$f":"IF(LEN(B277)=0,\"\",ROUND(B277*'Base Values'!$B$14,0))","v":""},""]
[{"$f":"IF(LEN('HVI Quality Data'!A278)>0,'HVI Quality Data'!A278,\"\")","v":""},null,null,{"$f":"IF(LEN(B278)=0,\"\",ROUND($B278*'HVI Quality Data'!R278/100,0))","v":""},{"$f":"IF(LEN(B278)=0,\"\",ROUND(B278*'Base Values'!$B$16,0))","v":""},{"$f":"IF(LEN(B278)=0,\"\",ROUND(E278/2000*'Base Values'!$B$10,0))","v":""},"",{"$f":"IF(OR(LEN(B278)=0,LEN(C278)=0),\"\",ROUND(B278/(C278/100)*'Base Values'!$B$12/100,0))","v":""},{"$f":"IF(LEN(B278)=0,\"\",ROUND(B278*'Base Values'!$B$14,0))","v":""},""]
[{"$f":"IF(LEN('HVI Quality Data'!A279)>0,'HVI Quality Data'!A279,\"\")","v":""},null,null,{"$f":"IF(LEN(B279)=0,\"\",ROUND($B279*'HVI Quality Data'!R279/100,0))","v":""},{"$f":"IF(LEN(B279)=0,\"\",ROUND(B279*'Base Values'!$B$16,0))","v":""},{"$f":"IF(LEN(B279)=0,\"\",ROUND(E279/2000*'Base Values'!$B$10,0))","v":""},"",{"$f":"IF(OR(LEN(B279)=0,LEN(C279)=0),\"\",ROUND(B279/(C279/100)*'Base Values'!$B$12/100,0))","v":""},{"$f":"IF(LEN(B279)=0,\"\",ROUND(B279*'Base Values'!$B$14,0))","v":""},""]
[{"$f":"IF(LEN('HVI Quality Data'!A280)>0,'HVI Quality Data'!A280,\"\")","v":""},null,null,{"$f":"IF(LEN(B280)=0,\"\",ROUND($B280*'HVI Quality Data'!R280/100,0))","v":""},{"$f":"IF(LEN(B280)=0,\"\",ROUND(B280*'Base Values'!$B$16,0))","v":""},{"$f":"IF(LEN(B280)=0,\"\",ROUND(E280/2000*'Base Values'!$B$10,0))","v":""},"",{"$f":"IF(OR(LEN(B280)=0,LEN(C280)=0),\"\",ROUND(B280/(C280/100)*'Base Values'!$B$12/100,0))","v":""},{"$f":"IF(LEN(B280)=0,\"\",ROUND(B280*'Base Values'!$B$14,0))","v":""},""]
[{"$f":"IF(LEN('HVI Quality Data'!A281)>0,'HVI Quality Data'!A281,\"\")","v":""},null,null,{"$f":"IF(LEN(B281)=0,\"\",ROUND($B281*'HVI Quality Data'!R281/100,0))","v":""},{"$f":"IF(LEN(B281)=0,\"\",ROUND(B281*'Base Values'!$B$16,0))","v":""},{"$f":"IF(LEN(B281)=0,\"\",ROUND(E281/2000*'Base Values'!$B$10,0))","v":""},"",{"$f":"IF(OR(LEN(B281)=0,LEN(C281)=0),\"\",ROUND(B281/(C281/100)*'Base Values'!$B$12/100,0))","v":""},{"$f":"IF(LEN(B281)=0,\"\",ROUND(B281*'Base Values'!$B$14,0))","v":""},""]
[{"$f":"IF(LEN('HVI Quality Data'!A282)>0,'HVI Quality Data'!A282,\"\")","v":""},null,null,{"$f":"IF(LEN(B282)=0,\"\",ROUND($B282*'HVI Quality Data'!R282/100,0))","v":""},{"$f":"IF(LEN(B282)=0,\"\",ROUND(B282*'Base Values'!$B$16,0))","v":""},{"$f":"IF(LEN(B282)=0,\"\",ROUND(E282/2000*'Base Values'!$B$10,0))","v":""},"",{"$f":"IF(OR(LEN(B282)=0,LEN(C282)=0),\"\",ROUND(B282/(C282/100)*'Base Values'!$B$12/100,0))","v":""},{"$f":"IF(LEN(B282)=0,\"\",ROUND(B282*'Base Values'!$B$14,0))","v":""},""]
[{"$f":"IF(LEN('HVI Quality Data'!A283)>0,'HVI Quality Data'!A283,\"\")","v":""},null,null,{"$f":"IF(LEN(B283)=0,\"\",ROUND($B283*'HVI Quality Data'!R283/100,0))","v":""},{"$f":"IF(LEN(B283)=0,\"\",ROUND(B283*'Base Values'!$B$16,0))","v":""},{"$f":"IF(LEN(B283)=0,\"\",ROUND(E283/2000*'Base Values'!$B$10,0))","v":""},"",{"$f":"IF(OR(LEN(B283)=0,LEN(C283)=0),\"\",ROUND(B283/(C283/100)*'Base Values'!$B$12/100,0))","v":""},{"$f":"IF(LEN(B283)=0,\"\",ROUND(B283*'Base Values'!$B$14,0))","v":""},""]
[{"$f":"IF(LEN('HVI Quality Data'!A284)>0,'HVI Quality Data'!A284,\"\")","v":""},null,null,{"$f":"IF(LEN(B284)=0,\"\",ROUND($B284*'HVI Quality Data'!R284/100,0))","v":""},{"$f":"IF(LEN(B284)=0,\"\",ROUND(B284*'Base Values'!$B$16,0))","v":""},{"$f":"IF(LEN(B284)=0,\"\",ROUND(E284/2000*'Base Values'!$B$10,0))","v":""},"",{"$f":"IF(OR(LEN(B284)=0,LEN(C284)=0),\"\",ROUND(B284/(C284/100)*'Base Values'!$B$12/100,0))","v":""},{"$f":"IF(LEN(B284)=0,\"\",ROUND(B284*'Base Values'!$B$14,0))","v":""},""]
[{"$f":"IF(LEN('HVI Quality Data'!A285)>0,'HVI Quality Data'!A285,\"\")","v":""},null,null,{"$f":"IF(LEN(B285)=0,\"\",ROUND($B285*'HVI Quality Data'!R285/100,0))","v":""},{"$f":"IF(LEN(B285)=0,\"\",ROUND(B285*'Base Values'!$B$16,0))","v":""},{"$f":"IF(LEN(B285)=0,\"\",ROUND(E285/2000*'Base Values'!$B$10,0))","v":""},"",{"$f":"IF(OR(LEN(B285)=0,LEN(C285)=0),\"\",ROUND(B285/(C285/100)*'Base Values'!$B$12/100,0))","v":""},{"$f":"IF(LEN(B285)=0,\"\",ROUND(B285*'Base Values'!$B$14,0))","v":""},""]
[{"$f":"IF(LEN('HVI Quality Data'!A286)>0,'HVI Quality Data'!A286,\"\")","v":""},null,null,{"$f":"IF(LEN(B286)=0,\"\",ROUND($B286*'HVI Quality Data'!R286/100,0))","v":""},{"$f":"IF(LEN(B286)=0,\"\",ROUND(B286*'Base Values'!$B$16,0))","v":""},{"$f":"IF(LEN(B286)=0,\"\",ROUND(E286/2000*'Base Values'!$B$10,0))","v":""},"",{"$f":"IF(OR(LEN(B286)=0,LEN(C286)=0),\"\",ROUND(B286/(C286/100)*'Base Values'!$B$12/100,0))","v":""},{"$f":"IF(LEN(B286)=0,\"\",ROUND(B286*'Base Values'!$B$14,0))","v":""},""]
[{"$f":"IF(LEN('HVI Quality Data'!A287)>0,'HVI Quality Data'!A287,\"\")","v":""},null,null,{"$f":"IF(LEN(B287)=0,\"\",ROUND($B287*'HVI Quality Data'!R287/100,0))","v":""},{"$f":"IF(LEN(B287)=0,\"\",ROUND(B287*'Base Values'!$B$16,0))","v":""},{"$f":"IF(LEN(B287)=0,\"\",ROUND(E287/2000*'Base Values'!$B$10,0))","v":""},"",{"$f":"IF(OR(LEN(B287)=0,LEN(C287)=0),\"\",ROUND(B287/(C287/100)*'Base Values'!$B$12/100,0))","v":""},{"$f":"IF(LEN(B287)=0,\"\",ROUND(B287*'Base Values'!$B$14,0))","v":""},""]
[{"$f":"IF(LEN('HVI Quality Data'!A288)>0,'HVI Quality Data'!A288,\"\")","v":""},null,null,{"$f":"IF(LEN(B288)=0,\"\",ROUND($B288*'HVI Quality Data'!R288/100,0))","v":""},{"$f":"IF(LEN(B288)=0,\"\",ROUND(B288*'Base Values'!$B$16,0))","v":""},{"$f":"IF(LEN(B288)=0,\"\",ROUND(E288/2000*'Base Values'!$B$10,0))","v":""},"",{"$f":"IF(OR(LEN(B288)=0,LEN(C288)=0),\"\",ROUND(B288/(C288/100)*'Base Values'!$B$12/100,0))","v":""},{"$f":"IF(LEN(B288)=0,\"\",ROUND(B288*'Base Values'!$B$14,0))","v":""},""]
[{"$f":"IF(LEN('HVI Quality Data'!A289)>0,'HVI Quality Data'!A289,\"\")","v":""},null,null,{"$f":"IF(LEN(B289)=0,\"\",ROUND($B289*'HVI Quality Data'!R289/100,0))","v":""},{"$f":"IF(LEN(B289)=0,\"\",ROUND(B289*'Base Values'!$B$16,0))","v":""},{"$f":"IF(LEN(B289)=0,\"\",ROUND(E289/2000*'Base Values'!$B$10,0))","v":""},"",{"$f":"IF(OR(LEN(B289)=0,LEN(C289)=0),\"\",ROUND(B289/(C289/100)*'Base Values'!$B$12/100,0))","v":""},{"$f":"IF(LEN(B289)=0,\"\",ROUND(B289*'Base Values'!$B$14,0))","v":""},""]
[{"$f":"IF(LEN('HVI Quality Data'!A290)>0,'HVI Quality Data'!A290,\"\")","v":""},null,null,{"$f":"IF(LEN(B290)=0,\"\",ROUND($B290*'HVI Quality Data'!R290/100,0))","v":""},{"$f":"IF(LEN(B290)=0,\"\",ROUND(B290*'Base Values'!$B$16,0))","v":""},{"$f":"IF(LEN(B290)=0,\"\",ROUND(E290/2000*'Base Values'!$B$10,0))","v":""},"",{"$f":"IF(OR(LEN(B290)=0,LEN(C290)=0),\"\",ROUND(B290/(C290/100)*'Base Values'!$B$12/100,0))","v":""},{"$f":"IF(LEN(B290)=0,\"\",ROUND(B290*'Base Values'!$B$14,0))","v":""},""]
[{"$f":"IF(LEN('HVI Quality Data'!A291)>0,'HVI Quality Data'!A291,\"\")","v":""},null,null,{"$f":"IF(LEN(B291)=0,\"\",ROUND($B291*'HVI Quality Data'!R291/100,0))","v":""},{"$f":"IF(LEN(B291)=0,\"\",ROUND(B291*'Base Values'!$B$16,0))","v":""},{"$f":"IF(LEN(B291)=0,\"\",ROUND(E291/2000*'Base Values'!$B$10,0))","v":""},"",{"$f":"IF(OR(LEN(B291)=0,LEN(C291)=0),\"\",ROUND(B291/(C291/100)*'Base Values'!$B$12/100,0))","v":""},{"$f":"IF(LEN(B291)=0,\"\",ROUND(B291*'Base Values'!$B$14,0))","v":""},""]
[{"$f":"IF(LEN('HVI Quality Data'!A292)>0,'HVI Quality Data'!A292,\"\")","v":""},null,null,{"$f":"IF(LEN(B292)=0,\"\",ROUND($B292*'HVI Quality Data'!R292/100,0))","v":""},{"$f":"IF(LEN(B292)=0,\"\",ROUND(B292*'Base Values'!$B$16,0))","v":""},{"$f":"IF(LEN(B292)=0,\"\",ROUND(E292/2000*'Base Values'!$B$10,0))","v":""},"",{"$f":"IF(OR(LEN(B292)=0,LEN(C292)=0),\"\",ROUND(B292/(C292/100)*'Base Values'!$B$12/100,0))","v":""},{"$f":"IF(LEN(B292)=0,\"\",ROUND(B292*'Base Values'!$B$14,0))","v":""},""]
[{"$f":"IF(LEN('HVI Quality Data'!A293)>0,'HVI Quality Data'!A293,\"\")","v":""},null,null,{"$f":"IF(LEN(B293)=0,\"\",ROUND($B293*'HVI Quality Data'!R293/100,0))","v":""},{"$f":"IF(LEN(B293)=0,\"\",ROUND(B293*'Base Values'!$B$16,0))","v":""},{"$f":"IF(LEN(B293)=0,\"\",ROUND(E293/2000*'Base Values'!$B$10,0))","v":""},"",{"$f":"IF(OR(LEN(B293)=0,LEN(C293)=0),\"\",ROUND(B293/(C293/100)*'Base Values'!$B$12/100,0))","v":""},{"$f":"IF(LEN(B293)=0,\"\",ROUND(B293*'Base Values'!$B$14,0))","v":""},""]
[{"$f":"IF(LEN('HVI Quality Data'!A294)>0,'HVI Quality Data'!A294,\"\")","v":""},null,null,{"$f":"IF(LEN(B294)=0,\"\",ROUND($B294*'HVI Quality Data'!R294/100,0))","v":""},{"$f":"IF(LEN(B294)=0,\"\",ROUND(B294*'Base Values'!$B$16,0))","v":""},{"$f":"IF(LEN(B294)=0,\"\",ROUND(E294/2000*'Base Values'!$B$10,0))","v":""},"",{"$f":"IF(OR(LEN(B294)=0,LEN(C294)=0),\"\",ROUND(B294/(C294/100)*'Base Values'!$B$12/100,0))","v":""},{"$f":"IF(LEN(B294)=0,\"\",ROUND(B294*'Base Values'!$B$14,0))","v":""},""]
[{"$f":"IF(LEN('HVI Quality Data'!A295)>0,'HVI Quality Data'!A295,\"\")","v":""},null,null,{"$f":"IF(LEN(B295)=0,\"\",ROUND($B295*'HVI Quality Data'!R295/100,0))","v":""},{"$f":"IF(LEN(B295)=0,\"\",ROUND(B295*'Base Values'!$B$16,0))","v":""},{"$f":"IF(LEN(B295)=0,\"\",ROUND(E295/2000*'Base Values'!$B$10,0))","v":""},"",{"$f":"IF(OR(LEN(B295)=0,LEN(C295)=0),\"\",ROUND(B295/(C295/100)*'Base Values'!$B$12/100,0))","v":""},{"$f":"IF(LEN(B295)=0,\"\",ROUND(B295*'Base Values'!$B$14,0))","v":""},""]
[{"$f":"IF(LEN('HVI Quality Data'!A296)>0,'HVI Quality Data'!A296,\"\")","v":""},null,null,{"$f":"IF(LEN(B296)=0,\"\",ROUND($B296*'HVI Quality Data'!R296/100,0))","v":""},{"$f":"IF(LEN(B296)=0,\"\",ROUND(B296*'Base Values'!$B$16,0))","v":""},{"$f":"IF(LEN(B296)=0,\"\",ROUND(E296/2000*'Base Values'!$B$10,0))","v":""},"",{"$f":"IF(OR(LEN(B296)=0,LEN(C296)=0),\"\",ROUND(B296/(C296/100)*'Base Values'!$B$12/100,0))","v":""},{"$f":"IF(LEN(B296)=0,\"\",ROUND(B296*'Base Values'!$B$14,0))","v":""},""]
[{"$f":"IF(LEN('HVI Quality Data'!A297)>0,'HVI Quality Data'!A297,\"\")","v":""},null,null,{"$f":"IF(LEN(B297)=0,\"\",ROUND($B297*'HVI Quality Data'!R297/100,0))","v":""},{"$f":"IF(LEN(B297)=0,\"\",ROUND(B297*'Base Values'!$B$16,0))","v":""},{"$f":"IF(LEN(B297)=0,\"\",ROUND(E297/2000*'Base Values'!$B$10,0))","v":""},"",{"$f":"IF(OR(LEN(B297)=0,LEN(C297)=0),\"\",ROUND(B297/(C297/100)*'Base Values'!$B$12/100,0))","v":""},{"$f":"IF(LEN(B297)=0,\"\",ROUND(B297*'Base Values'!$B$14,0))","v":""},""]
[{"$f":"IF(LEN('HVI Quality Data'!A298)>0,'HVI Quality Data'!A298,\"\")","v":""},null,null,{"$f":"IF(LEN(B298)=0,\"\",ROUND($B298*'HVI Quality Data'!R298/100,0))","v":""},{"$f":"IF(LEN(B298)=0,\"\",ROUND(B298*'Base Values'!$B$16,0))","v":""},{"$f":"IF(LEN(B298)=0,\"\",ROUND(E298/2000*'Base Values'!$B$10,0))","v":""},"",{"$f":"IF(OR(LEN(B298)=0,LEN(C298)=0),\"\",ROUND(B298/(C298/100)*'Base Values'!$B$12/100,0))","v":""},{"$f":"IF(LEN(B298)=0,\"\",ROUND(B298*'Base Values'!$B$14,0))","v":""},""]
[{"$f":"IF(LEN('HVI Quality Data'!A299)>0,'HVI Quality Data'!A299,\"\")","v":""},null,null,{"$f":"IF(LEN(B299)=0,\"\",ROUND($B299*'HVI Quality Data'!R299/100,0))","v":""},{"$f":"IF(LEN(B299)=0,\"\",ROUND(B299*'Base Values'!$B$16,0))","v":""},{"$f":"IF(LEN(B299)=0,\"\",ROUND(E299/2000*'Base Values'!$B$10,0))","v":""},"",{"$f":"IF(OR(LEN(B299)=0,LEN(C299)=0),\"\",ROUND(B299/(C299/100)*'Base Values'!$B$12/100,0))","v":""},{"$f":"IF(LEN(B299)=0,\"\",ROUND(B299*'Base Values'!$B$14,0))","v":""},""]
[{"$f":"IF(LEN('HVI Quality Data'!A300)>0,'HVI Quality Data'!A300,\"\")","v":""},null,null,{"$f":"IF(LEN(B300)=0,\"\",ROUND($B300*'HVI Quality Data'!R300/100,0))","v":""},{"$f":"IF(LEN(B300)=0,\"\",ROUND(B300*'Base Values'!$B$16,0))","v":""},{"$f":"IF(LEN(B300)=0,\"\",ROUND(E300/2000*'Base Values'!$B$10,0))","v":""},"",{"$f":"IF(OR(LEN(B300)=0,LEN(C300)=0),\"\",ROUND(B300/(C300/100)*'Base Values'!$B$12/100,0))","v":""},{"$f":"IF(LEN(B300)=0,\"\",ROUND(B300*'Base Values'!$B$14,0))","v":""},""]
[{"$f":"IF(LEN('HVI Quality Data'!A301)>0,'HVI Quality Data'!A301,\"\")","v":""},null,null,{"$f":"IF(LEN(B301)=0,\"\",ROUND($B301*'HVI Quality Data'!R301/100,0))","v":""},{"$f":"IF(LEN(B301)=0,\"\",ROUND(B301*'Base Values'!$B$16,0))","v":""},{"$f":"IF(LEN(B301)=0,\"\",ROUND(E301/2000*'Base Values'!$B$10,0))","v":""},"",{"$f":"IF(OR(LEN(B301)=0,LEN(C301)=0),\"\",ROUND(B301/(C301/100)*'Base Values'!$B$12/100,0))","v":""},{"$f":"IF(LEN(B301)=0,\"\",ROUND(B301*'Base Values'!$B$14,0))","v":""},""]
[{"$f":"IF(LEN('HVI Quality Data'!A302)>0,'HVI Quality Data'!A302,\"\")","v":""},null,null,{"$f":"IF(LEN(B302)=0,\"\",ROUND($B302*'HVI Quality Data'!R302/100,0))","v":""},{"$f":"IF(LEN(B302)=0,\"\",ROUND(B302*'Base Values'!$B$16,0))","v":""},{"$f":"IF(LEN(B302)=0,\"\",ROUND(E302/2000*'Base Values'!$B$10,0))","v":""},"",{"$f":"IF(OR(LEN(B302)=0,LEN(C302)=0),\"\",ROUND(B302/(C302/100)*'Base Values'!$B$12/100,0))","v":""},{"$f":"IF(LEN(B302)=0,\"\",ROUND(B302*'Base Values'!$B$14,0))","v":""},""]
[{"$f":"IF(LEN('HVI Quality Data'!A303)>0,'HVI Quality Data'!A303,\"\")","v":""},null,null,{"$f":"IF(LEN(B303)=0,\"\",ROUND($B303*'HVI Quality Data'!R303/100,0))","v":""},{"$f":"IF(LEN(B303)=0,\"\",ROUND(B303*'Base Values'!$B$16,0))","v":""},{"$f":"IF(LEN(B303)=0,\"\",ROUND(E303/2000*'Base Values'!$B$10,0))","v":""},"",{"$f":"IF(OR(LEN(B303)=0,LEN(C303)=0),\"\",ROUND(B303/(C303/100)*'Base Values'!$B$12/100,0))","v":""},{"$f":"IF(LEN(B303)=0,\"\",ROUND(B303*'Base Values'!$B$14,0))","v":""},""]
[{"$f":"IF(LEN('HVI Quality Data'!A304)>0,'HVI Quality Data'!A304,\"\")","v":""},null,null,{"$f":"IF(LEN(B304)=0,\"\",ROUND($B304*'HVI Quality Data'!R304/100,0))","v":""},{"$f":"IF(LEN(B304)=0,\"\",ROUND(B304*'Base Values'!$B$16,0))","v":""},{"$f":"IF(LEN(B304)=0,\"\",ROUND(E304/2000*'Base Values'!$B$10,0))","v":""},"",{"$f":"IF(OR(LEN(B304)=0,LEN(C304)=0),\"\",ROUND(B304/(C304/100)*'Base Values'!$B$12/100,0))","v":""},{"$f":"IF(LEN(B304)=0,\"\",ROUND(B304*'Base Values'!$B$14,0))","v":""},""]
[{"$f":"IF(LEN('HVI Quality Data'!A305)>0,'HVI Quality Data'!A305,\"\")","v":""},null,null,{"$f":"IF(LEN(B305)=0,\"\",ROUND($B305*'HVI Quality Data'!R305/100,0))","v":""},{"$f":"IF(LEN(B305)=0,\"\",ROUND(B305*'Base Values'!$B$16,0))","v":""},{"$f":"IF(LEN(B305)=0,\"\",ROUND(E305/2000*'Base Values'!$B$10,0))","v":""},"",{"$f":"IF(OR(LEN(B305)=0,LEN(C305)=0),\"\",ROUND(B305/(C305/100)*'Base Values'!$B$12/100,0))","v":""},{"$f":"IF(LEN(B305)=0,\"\",ROUND(B305*'Base Values'!$B$14,0))","v":""},""]
[{"$f":"IF(LEN('HVI Quality Data'!A306)>0,'HVI Quality Data'!A306,\"\")","v":""},null,null,{"$f":"IF(LEN(B306)=0,\"\",ROUND($B306*'HVI Quality Data'!R306/100,0))","v":""},{"$f":"IF(LEN(B306)=0,\"\",ROUND(B306*'Base Values'!$B$16,0))","v":""},{"$f":"IF(LEN(B306)=0,\"\",ROUND(E306/2000*'Base Values'!$B$10,0))","v":""},"",{"$f":"IF(OR(LEN(B306)=0,LEN(C306)=0),\"\",ROUND(B306/(C306/100)*'Base Values'!$B$12/100,0))","v":""},{"$f":"IF(LEN(B306)=0,\"\",ROUND(B306*'Base Values'!$B$14,0))","v":""},""]
[{"$f":"IF(LEN('HVI Quality Data'!A307)>0,'HVI Quality Data'!A307,\"\")","v":""},null,null,{"$f":"IF(LEN(B307)=0,\"\",ROUND($B307*'HVI Quality Data'!R307/100,0))","v":""},{"$f":"IF(LEN(B307)=0,\"\",ROUND(B307*'Base Values'!$B$16,0))","v":""},{"$f":"IF(LEN(B307)=0,\"\",ROUND(E307/2000*'Base Values'!$B$10,0))","v":""},"",{"$f":"IF(OR(LEN(B307)=0,LEN(C307)=0),\"\",ROUND(B307/(C307/100)*'Base Values'!$B$12/100,0))","v":""},{"$f":"IF(LEN(B307)=0,\"\",ROUND(B307*'Base Values'!$B$14,0))","v":""},""]
[{"$f":"IF(LEN('HVI Quality Data'!A308)>0,'HVI Quality Data'!A308,\"\")","v":""},null,null,{"$f":"IF(LEN(B308)=0,\"\",ROUND($B308*'HVI Quality Data'!R308/100,0))","v":""},{"$f":"IF(LEN(B308)=0,\"\",ROUND(B308*'Base Values'!$B$16,0))","v":""},{"$f":"IF(LEN(B308)=0,\"\",ROUND(E308/2000*'Base Values'!$B$10,0))","v":""},"",{"$f":"IF(OR(LEN(B308)=0,LEN(C308)=0),\"\",ROUND(B308/(C308/100)*'Base Values'!$B$12/100,0))","v":""},{"$f":"IF(LEN(B308)=0,\"\",ROUND(B308*'Base Values'!$B$14,0))","v":""},""]
[{"$f":"IF(LEN('HVI Quality Data'!A309)>0,'HVI Quality Data'!A309,\"\")","v":""},null,null,{"$f":"IF(LEN(B309)=0,\"\",ROUND($B309*'HVI Quality Data'!R309/100,0))","v":""},{"$f":"IF(LEN(B309)=0,\"\",ROUND(B309*'Base Values'!$B$16,0))","v":""},{"$f":"IF(LEN(B309)=0,\"\",ROUND(E309/2000*'Base Values'!$B$10,0))","v":""},"",{"$f":"IF(OR(LEN(B309)=0,LEN(C309)=0),\"\",ROUND(B309/(C309/100)*'Base Values'!$B$12/100,0))","v":""},{"$f":"IF(LEN(B309)=0,\"\",ROUND(B309*'Base Values'!$B$14,0))","v":""},""]
[{"$f":"IF(LEN('HVI Quality Data'!A310)>0,'HVI Quality Data'!A310,\"\")","v":""},null,null,{"$f":"IF(LEN(B310)=0,\"\",ROUND($B310*'HVI Quality Data'!R310/100,0))","v":""},{"$f":"IF(LEN(B310)=0,\"\",ROUND(B310*'Base Values'!$B$16,0))","v":""},{"$f":"IF(LEN(B310)=0,\"\",ROUND(E310/2000*'Base Values'!$B$10,0))","v":""},"",{"$f":"IF(OR(LEN(B310)=0,LEN(C310)=0),\"\",ROUND(B310/(C310/100)*'Base Values'!$B$12/100,0))","v":""},{"$f":"IF(LEN(B310)=0,\"\",ROUND(B310*'Base Values'!$B$14,0))","v":""},""]
[{"$f":"IF(LEN('HVI Quality Data'!A311)>0,'HVI Quality Data'!A311,\"\")","v":""},null,null,{"$f":"IF(LEN(B311)=0,\"\",ROUND($B311*'HVI Quality Data'!R311/100,0))","v":""},{"$f":"IF(LEN(B311)=0,\"\",ROUND(B311*'Base Values'!$B$16,0))","v":""},{"$f":"IF(LEN(B311)=0,\"\",ROUND(E311/2000*'Base Values'!$B$10,0))","v":""},"",{"$f":"IF(OR(LEN(B311)=0,LEN(C311)=0),\"\",ROUND(B311/(C311/100)*'Base Values'!$B$12/100,0))","v":""},{"$f":"IF(LEN(B311)=0,\"\",ROUND(B311*'Base Values'!$B$14,0))","v":""},""]
[{"$f":"IF(LEN('HVI Quality Data'!A312)>0,'HVI Quality Data'!A312,\"\")","v":""},null,null,{"$f":"IF(LEN(B312)=0,\"\",ROUND($B312*'HVI Quality Data'!R312/100,0))","v":""},{"$f":"IF(LEN(B312)=0,\"\",ROUND(B312*'Base Values'!$B$16,0))","v":""},{"$f":"IF(LEN(B312)=0,\"\",ROUND(E312/2000*'Base Values'!$B$10,0))","v":""},"",{"$f":"IF(OR(LEN(B312)=0,LEN(C312)=0),\"\",ROUND(B312/(C312/100)*'Base Values'!$B$12/100,0))","v":""},{"$f":"IF(LEN(B312)=0,\"\",ROUND(B312*'Base Values'!$B$14,0))","v":""},""]
[{"$f":"IF(LEN('HVI Quality Data'!A313)>0,'HVI Quality Data'!A313,\"\")","v":""},null,null,{"$f":"IF(LEN(B313)=0,\"\",ROUND($B313*'HVI Quality Data'!R313/100,0))","v":""},{"$f":"IF(LEN(B313)=0,\"\",ROUND(B313*'Base Values'!$B$16,0))","v":""},{"$f":"IF(LEN(B313)=0,\"\",ROUND(E313/2000*'Base Values'!$B$10,0))","v":""},"",{"$f":"IF(OR(LEN(B313)=0,LEN(C313)=0),\"\",ROUND(B313/(C313/100)*'Base Values'!$B$12/100,0))","v":""},{"$f":"IF(LEN(B313)=0,\"\",ROUND(B313*'Base Values'!$B$14,0))","v":""},""]
[{"$f":"IF(LEN('HVI Quality Data'!A314)>0,'HVI Quality Data'!A314,\"\")","v":""},null,null,{"$f":"IF(LEN(B314)=0,\"\",ROUND($B314*'HVI Quality Data'!R314/100,0))","v":""},{"$f":"IF(LEN(B314)=0,\"\",ROUND(B314*'Base Values'!$B$16,0))","v":""},{"$f":"IF(LEN(B314)=0,\"\",ROUND(E314/2000*'Base Values'!$B$10,0))","v":""},"",{"$f":"IF(OR(LEN(B314)=0,LEN(C314)=0),\"\",ROUND(B314/(C314/100)*'Base Values'!$B$12/100,0))","v":""},{"$f":"IF(LEN(B314)=0,\"\",ROUND(B314*'Base Values'!$B$14,0))","v":""},""]
[{"$f":"IF(LEN('HVI Quality Data'!A315)>0,'HVI Quality Data'!A315,\"\")","v":""},null,null,{"$f":"IF(LEN(B315)=0,\"\",ROUND($B315*'HVI Quality Data'!R315/100,0))","v":""},{"$f":"IF(LEN(B315)=0,\"\",ROUND(B315*'Base Values'!$B$16,0))","v":""},{"$f":"IF(LEN(B315)=0,\"\",ROUND(E315/2000*'Base Values'!$B$10,0))","v":""},"",{"$f":"IF(OR(LEN(B315)=0,LEN(C315)=0),\"\",ROUND(B315/(C315/100)*'Base Values'!$B$12/100,0))","v":""},{"$f":"IF(LEN(B315)=0,\"\",ROUND(B315*'Base Values'!$B$14,0))","v":""},""]
[{"$f":"IF(LEN('HVI Quality Data'!A316)>0,'HVI Quality Data'!A316,\"\")","v":""},null,null,{"$f":"IF(LEN(B316)=0,\"\",ROUND($B316*'HVI Quality Data'!R316/100,0))","v":""},{"$f":"IF(LEN(B316)=0,\"\",ROUND(B316*'Base Values'!$B$16,0))","v":""},{"$f":"IF(LEN(B316)=0,\"\",ROUND(E316/2000*'Base Values'!$B$10,0))","v":""},"",{"$f":"IF(OR(LEN(B316)=0,LEN(C316)=0),\"\",ROUND(B316/(C316/100)*'Base Values'!$B$12/100,0))","v":""},{"$f":"IF(LEN(B316)=0,\"\",ROUND(B316*'Base Values'!$B$14,0))","v":""},""]
[{"$f":"IF(LEN('HVI Quality Data'!A317)>0,'HVI Quality Data'!A317,\"\")","v":""},null,null,{"$f":"IF(LEN(B317)=0,\"\",ROUND($B317*'HVI Quality Data'!R317/100,0))","v":""},{"$f":"IF(LEN(B317)=0,\"\",ROUND(B317*'Base Values'!$B$16,0))","v":""},{"$f":"IF(LEN(B317)=0,\"\",ROUND(E317/2000*'Base Values'!$B$10,0))","v":""},"",{"$f":"IF(OR(LEN(B317)=0,LEN(C317)=0),\"\",ROUND(B317/(C317/100)*'Base Values'!$B$12/100,0))","v":""},{"$f":"IF(LEN(B317)=0,\"\",ROUND(B317*'Base Values'!$B$14,0))","v":""},""]
[{"$f":"IF(LEN('HVI Quality Data'!A318)>0,'HVI Quality Data'!A318,\"\")","v":""},null,null,{"$f":"IF(LEN(B318)=0,\"\",ROUND($B318*'HVI Quality Data'!R318/100,0))","v":""},{"$f":"IF(LEN(B318)=0,\"\",ROUND(B318*'Base Values'!$B$16,0))","v":""},{"$f":"IF(LEN(B318)=0,\"\",ROUND(E318/2000*'Base Values'!$B$10,0))","v":""},"",{"$f":"IF(OR(LEN(B318)=0,LEN(C318)=0),\"\",ROUND(B318/(C318/100)*'Base Values'!$B$12/100,0))","v":""},{"$f":"IF(LEN(B318)=0,\"\",ROUND(B318*'Base Values'!$B$14,0))","v":""},""]
[{"$f":"IF(LEN('HVI Quality Data'!A319)>0,'HVI Quality Data'!A319,\"\")","v":""},null,null,{"$f":"IF(LEN(B319)=0,\"\",ROUND($B319*'HVI Quality Data'!R319/100,0))","v":""},{"$f":"IF(LEN(B319)=0,\"\",ROUND(B319*'Base Values'!$B$16,0))","v":""},{"$f":"IF(LEN(B319)=0,\"\",ROUND(E319/2000*'Base Values'!$B$10,0))","v":""},"",{"$f":"IF(OR(LEN(B319)=0,LEN(C319)=0),\"\",ROUND(B319/(C319/100)*'Base Values'!$B$12/100,0))","v":""},{"$f":"IF(LEN(B319)=0,\"\",ROUND(B319*'Base Values'!$B$14,0))","v":""},""]
[{"$f":"IF(LEN('HVI Quality Data'!A320)>0,'HVI Quality Data'!A320,\"\")","v":""},null,null,{"$f":"IF(LEN(B320)=0,\"\",ROUND($B320*'HVI Quality Data'!R320/100,0))","v":""},{"$f":"IF(LEN(B320)=0,\"\",ROUND(B320*'Base Values'!$B$16,0))","v":""},{"$f":"IF(LEN(B320)=0,\"\",ROUND(E320/2000*'Base Values'!$B$10,0))","v":""},"",{"$f":"IF(OR(LEN(B320)=0,LEN(C320)=0),\"\",ROUND(B320/(C320/100)*'Base Values'!$B$12/100,0))","v":""},{"$f":"IF(LEN(B320)=0,\"\",ROUND(B320*'Base Values'!$B$14,0))","v":""},""]
[{"$f":"IF(LEN('HVI Quality Data'!A321)>0,'HVI Quality Data'!A321,\"\")","v":""},null,null,{"$f":"IF(LEN(B321)=0,\"\",ROUND($B321*'HVI Quality Data'!R321/100,0))","v":""},{"$f":"IF(LEN(B321)=0,\"\",ROUND(B321*'Base Values'!$B$16,0))","v":""},{"$f":"IF(LEN(B321)=0,\"\",ROUND(E321/2000*'Base Values'!$B$10,0))","v":""},"",{"$f":"IF(OR(LEN(B321)=0,LEN(C321)=0),\"\",ROUND(B321/(C321/100)*'Base Values'!$B$12/100,0))","v":""},{"$f":"IF(LEN(B321)=0,\"\",ROUND(B321*'Base Values'!$B$14,0))","v":""},""]
[{"$f":"IF(LEN('HVI Quality Data'!A322)>0,'HVI Quality Data'!A322,\"\")","v":""},null,null,{"$f":"IF(LEN(B322)=0,\"\",ROUND($B322*'HVI Quality Data'!R322/100,0))","v":""},{"$f":"IF(LEN(B322)=0,\"\",ROUND(B322*'Base Values'!$B$16,0))","v":""},{"$f":"IF(LEN(B322)=0,\"\",ROUND(E322/2000*'Base Values'!$B$10,0))","v":""},"",{"$f":"IF(OR(LEN(B322)=0,LEN(C322)=0),\"\",ROUND(B322/(C322/100)*'Base Values'!$B$12/100,0))","v":""},{"$f":"IF(LEN(B322)=0,\"\",ROUND(B322*'Base Values'!$B$14,0))","v":""},""]
[{"$f":"IF(LEN('HVI Quality Data'!A323)>0,'HVI Quality Data'!A323,\"\")","v":""},null,null,{"$f":"IF(LEN(B323)=0,\"\",ROUND($B323*'HVI Quality Data'!R323/100,0))","v":""},{"$f":"IF(LEN(B323)=0,\"\",ROUND(B323*'Base Values'!$B$16,0))","v":""},{"$f":"IF(LEN(B323)=0,\"\",ROUND(E323/2000*'Base Values'!$B$10,0))","v":""},"",{"$f":"IF(OR(LEN(B323)=0,LEN(C323)=0),\"\",ROUND(B323/(C323/100)*'Base Values'!$B$12/100,0))","v":""},{"$f":"IF(LEN(B323)=0,\"\",ROUND(B323*'Base Values'!$B$14,0))","v":""},""]
[{"$f":"IF(LEN('HVI Quality Data'!A324)>0,'HVI Quality Data'!A324,\"\")","v":""},null,null,{"$f":"IF(LEN(B324)=0,\"\",ROUND($B324*'HVI Quality Data'!R324/100,0))","v":""},{"$f":"IF(LEN(B324)=0,\"\",ROUND(B324*'Base Values'!$B$16,0))","v":""},{"$f":"IF(LEN(B324)=0,\"\",ROUND(E324/2000*'Base Values'!$B$10,0))","v":""},"",{"$f":"IF(OR(LEN(B324)=0,LEN(C324)=0),\"\",ROUND(B324/(C324/100)*'Base Values'!$B$12/100,0))","v":""},{"$f":"IF(LEN(B324)=0,\"\",ROUND(B324*'Base Values'!$B$14,0))","v":""},""]
[{"$f":"IF(LEN('HVI Quality Data'!A325)>0,'HVI Quality Data'!A325,\"\")","v":""},null,null,{"$f":"IF(LEN(B325)=0,\"\",ROUND($B325*'HVI Quality Data'!R325/100,0))","v":""},{"$f":"IF(LEN(B325)=0,\"\",ROUND(B325*'Base Values'!$B$16,0))","v":""},{"$f":"IF(LEN(B325)=0,\"\",ROUND(E325/2000*'Base Values'!$B$10,0))","v":""},"",{"$f":"IF(OR(LEN(B325)=0,LEN(C325)=0),\"\",ROUND(B325/(C325/100)*'Base Values'!$B$12/100,0))","v":""},{"$f":"IF(LEN(B325)=0,\"\",ROUND(B325*'Base Values'!$B$14,0))","v":""},""]
[{"$f":"IF(LEN('HVI Quality Data'!A326)>0,'HVI Quality Data'!A326,\"\")","v":""},null,null,{"$f":"IF(LEN(B326)=0,\"\",ROUND($B326*'HVI Quality Data'!R326/100,0))","v":""},{"$f":"IF(LEN(B326)=0,\"\",ROUND(B326*'Base Values'!$B$16,0))","v":""},{"$f":"IF(LEN(B326)=0,\"\",ROUND(E326/2000*'Base Values'!$B$10,0))","v":""},"",{"$f":"IF(OR(LEN(B326)=0,LEN(C326)=0),\"\",ROUND(B326/(C326/100)*'Base Values'!$B$12/100,0))","v":""},{"$f":"IF(LEN(B326)=0,\"\",ROUND(B326*'Base Values'!$B$14,0))","v":""},""]
[{"$f":"IF(LEN('HVI Quality Data'!A327)>0,'HVI Quality Data'!A327,\"\")","v":""},null,null,{"$f":"IF(LEN(B327)=0,\"\",ROUND($B327*'HVI Quality Data'!R327/100,0))","v":""},{"$f":"IF(LEN(B327)=0,\"\",ROUND(B327*'Base Values'!$B$16,0))","v":""},{"$f":"IF(LEN(B327)=0,\"\",ROUND(E327/2000*'Base Values'!$B$10,0))","v":""},"",{"$f":"IF(OR(LEN(B327)=0,LEN(C327)=0),\"\",ROUND(B327/(C327/100)*'Base Values'!$B$12/100,0))","v":""},{"$f":"IF(LEN(B327)=0,\"\",ROUND(B327*'Base Values'!$B$14,0))","v":""},""]
[{"$f":"IF(LEN('HVI Quality Data'!A328)>0,'HVI Quality Data'!A328,\"\")","v":""},null,null,{"$f":"IF(LEN(B328)=0,\"\",ROUND($B328*'HVI Quality Data'!R328/100,0))","v":""},{"$f":"IF(LEN(B328)=0,\"\",ROUND(B328*'Base Values'!$B$16,0))","v":""},{"$f":"IF(LEN(B328)=0,\"\",ROUND(E328/2000*'Base Values'!$B$10,0))","v":""},"",{"$f":"IF(OR(LEN(B328)=0,LEN(C328)=0),\"\",ROUND(B328/(C328/100)*'Base Values'!$B$12/100,0))","v":""},{"$f":"IF(LEN(B328)=0,\"\",ROUND(B328*'Base Values'!$B$14,0))","v":""},""]
[{"$f":"IF(LEN('HVI Quality Data'!A329)>0,'HVI Quality Data'!A329,\"\")","v":""},null,null,{"$f":"IF(LEN(B329)=0,\"\",ROUND($B329*'HVI Quality Data'!R329/100,0))","v":""},{"$f":"IF(LEN(B329)=0,\"\",ROUND(B329*'Base Values'!$B$16,0))","v":""},{"$f":"IF(LEN(B329)=0,\"\",ROUND(E329/2000*'Base Values'!$B$10,0))","v":""},"",{"$f":"IF(OR(LEN(B329)=0,LEN(C329)=0),\"\",ROUND(B329/(C329/100)*'Base Values'!$B$12/100,0))","v":""},{"$f":"IF(LEN(B329)=0,\"\",ROUND(B329*'Base Values'!$B$14,0))","v":""},""]
[{"$f":"IF(LEN('HVI Quality Data'!A330)>0,'HVI Quality Data'!A330,\"\")","v":""},null,null,{"$f":"IF(LEN(B330)=0,\"\",ROUND($B330*'HVI Quality Data'!R330/100,0))","v":""},{"$f":"IF(LEN(B330)=0,\"\",ROUND(B330*'Base Values'!$B$16,0))","v":""},{"$f":"IF(LEN(B330)=0,\"\",ROUND(E330/2000*'Base Values'!$B$10,0))","v":""},"",{"$f":"IF(OR(LEN(B330)=0,LEN(C330)=0),\"\",ROUND(B330/(C330/100)*'Base Values'!$B$12/100,0))","v":""},{"$f":"IF(LEN(B330)=0,\"\",ROUND(B330*'Base Values'!$B$14,0))","v":""},""]
[{"$f":"IF(LEN('HVI Quality Data'!A331)>0,'HVI Quality Data'!A331,\"\")","v":""},null,null,{"$f":"IF(LEN(B331)=0,\"\",ROUND($B331*'HVI Quality Data'!R331/100,0))","v":""},{"$f":"IF(LEN(B331)=0,\"\",ROUND(B331*'Base Values'!$B$16,0))","v":""},{"$f":"IF(LEN(B331)=0,\"\",ROUND(E331/2000*'Base Values'!$B$10,0))","v":""},"",{"$f":"IF(OR(LEN(B331)=0,LEN(C331)=0),\"\",ROUND(B331/(C331/100)*'Base Values'!$B$12/100,0))","v":""},{"$f":"IF(LEN(B331)=0,\"\",ROUND(B331*'Base Values'!$B$14,0))","v":""},""]
[{"$f":"IF(LEN('HVI Quality Data'!A332)>0,'HVI Quality Data'!A332,\"\")","v":""},null,null,{"$f":"IF(LEN(B332)=0,\"\",ROUND($B332*'HVI Quality Data'!R332/100,0))","v":""},{"$f":"IF(LEN(B332)=0,\"\",ROUND(B332*'Base Values'!$B$16,0))","v":""},{"$f":"IF(LEN(B332)=0,\"\",ROUND(E332/2000*'Base Values'!$B$10,0))","v":""},"",{"$f":"IF(OR(LEN(B332)=0,LEN(C332)=0),\"\",ROUND(B332/(C332/100)*'Base Values'!$B$12/100,0))","v":""},{"$f":"IF(LEN(B332)=0,\"\",ROUND(B332*'Base Values'!$B$14,0))","v":""},""]
[{"$f":"IF(LEN('HVI Quality Data'!A333)>0,'HVI Quality Data'!A333,\"\")","v":""},null,null,{"$f":"IF(LEN(B333)=0,\"\",ROUND($B333*'HVI Quality Data'!R333/100,0))","v":""},{"$f":"IF(LEN(B333)=0,\"\",ROUND(B333*'Base Values'!$B$16,0))","v":""},{"$f":"IF(LEN(B333)=0,\"\",ROUND(E333/2000*'Base Values'!$B$10,0))","v":""},"",{"$f":"IF(OR(LEN(B333)=0,LEN(C333)=0),\"\",ROUND(B333/(C333/100)*'Base Values'!$B$12/100,0))","v":""},{"$f":"IF(LEN(B333)=0,\"\",ROUND(B333*'Base Values'!$B$14,0))","v":""},""]
[{"$f":"IF(LEN('HVI Quality Data'!A334)>0,'HVI Quality Data'!A334,\"\")","v":""},null,null,{"$f":"IF(LEN(B334)=0,\"\",ROUND($B334*'HVI Quality Data'!R334/100,0))","v":""},{"$f":"IF(LEN(B334)=0,\"\",ROUND(B334*'Base Values'!$B$16,0))","v":""},{"$f":"IF(LEN(B334)=0,\"\",ROUND(E334/2000*'Base Values'!$B$10,0))","v":""},"",{"$f":"IF(OR(LEN(B334)=0,LEN(C334)=0),\"\",ROUND(B334/(C334/100)*'Base Values'!$B$12/100,0))","v":""},{"$f":"IF(LEN(B334)=0,\"\",ROUND(B334*'Base Values'!$B$14,0))","v":""},""]
[{"$f":"IF(LEN('HVI Quality Data'!A335)>0,'HVI Quality Data'!A335,\"\")","v":""},null,null,{"$f":"IF(LEN(B335)=0,\"\",ROUND($B335*'HVI Quality Data'!R335/100,0))","v":""},{"$f":"IF(LEN(B335)=0,\"\",ROUND(B335*'Base Values'!$B$16,0))","v":""},{"$f":"IF(LEN(B335)=0,\"\",ROUND(E335/2000*'Base Values'!$B$10,0))","v":""},"",{"$f":"IF(OR(LEN(B335)=0,LEN(C335)=0),\"\",ROUND(B335/(C335/100)*'Base Values'!$B$12/100,0))","v":""},{"$f":"IF(LEN(B335)=0,\"\",ROUND(B335*'Base Values'!$B$14,0))","v":""},""]
[{"$f":"IF(LEN('HVI Quality Data'!A336)>0,'HVI Quality Data'!A336,\"\")","v":""},null,null,{"$f":"IF(LEN(B336)=0,\"\",ROUND($B336*'HVI Quality Data'!R336/100,0))","v":""},{"$f":"IF(LEN(B336)=0,\"\",ROUND(B336*'Base Values'!$B$16,0))","v":""},{"$f":"IF(LEN(B336)=0,\"\",ROUND(E336/2000*'Base Values'!$B$10,0))","v":""},{"$f":"IF(LEN(B336)=0,\"\",SUM(D336,F336))","v":""},{"$f":"IF(OR(LEN(B336)=0,LEN(C336)=0),\"\",ROUND(B336/(C336/100)*'Base Values'!$B$12/100,0))","v":""},{"$f":"IF(LEN(B336)=0,\"\",ROUND(B336*'Base Values'!$B$14,0))","v":""},{"$f":"IF(OR(LEN(B336)=0,LEN(C336)=0),\"\",G336-H336-I336)","v":""}]
[{"$f":"IF(LEN('HVI Quality Data'!A337)>0,'HVI Quality Data'!A337,\"\")","v":""},null,null,{"$f":"IF(LEN(B337)=0,\"\",ROUND($B337*'HVI Quality Data'!R337/100,0))","v":""},{"$f":"IF(LEN(B337)=0,\"\",ROUND(B337*'Base Values'!$B$16,0))","v":""},{"$f":"IF(LEN(B337)=0,\"\",ROUND(E337/2000*'Base Values'!$B$10,0))","v":""},"",{"$f":"IF(OR(LEN(B337)=0,LEN(C337)=0),\"\",ROUND(B337/(C337/100)*'Base Values'!$B$12/100,0))","v":""},{"$f":"IF(LEN(B337)=0,\"\",ROUND(B337*'Base Values'!$B$14,0))","v":""},""]
[{"$f":"IF(LEN('HVI Quality Data'!A338)>0,'HVI Quality Data'!A338,\"\")","v":""},null,null,{"$f":"IF(LEN(B338)=0,\"\",ROUND($B338*'HVI Quality Data'!R338/100,0))","v":""},{"$f":"IF(LEN(B338)=0,\"\",ROUND(B338*'Base Values'!$B$16,0))","v":""},{"$f":"IF(LEN(B338)=0,\"\",ROUND(E338/2000*'Base Values'!$B$10,0))","v":""},"",{"$f":"IF(OR(LEN(B338)=0,LEN(C338)=0),\"\",ROUND(B338/(C338/100)*'Base Values'!$B$12/100,0))","v":""},{"$f":"IF(LEN(B338)=0,\"\",ROUND(B338*'Base Values'!$B$14,0))","v":""},""]
[{"$f":"IF(LEN('HVI Quality Data'!A339)>0,'HVI Quality Data'!A339,\"\")","v":""},null,null,{"$f":"IF(LEN(B339)=0,\"\",ROUND($B339*'HVI Quality Data'!R339/100,0))","v":""},{"$f":"IF(LEN(B339)=0,\"\",ROUND(B339*'Base Values'!$B$16,0))","v":""},{"$f":"IF(LEN(B339)=0,\"\",ROUND(E339/2000*'Base Values'!$B$10,0))","v":""},"",{"$f":"IF(OR(LEN(B339)=0,LEN(C339)=0),\"\",ROUND(B339/(C339/100)*'Base Values'!$B$12/100,0))","v":""},{"$f":"IF(LEN(B339)=0,\"\",ROUND(B339*'Base Values'!$B$14,0))","v":""},""]
[{"$f":"IF(LEN('HVI Quality Data'!A340)>0,'HVI Quality Data'!A340,\"\")","v":""},null,null,{"$f":"IF(LEN(B340)=0,\"\",ROUND($B340*'HVI Quality Data'!R340/100,0))","v":""},{"$f":"IF(LEN(B340)=0,\"\",ROUND(B340*'Base Values'!$B$16,0))","v":""},{"$f":"IF(LEN(B340)=0,\"\",ROUND(E340/2000*'Base Values'!$B$10,0))","v":""},"",{"$f":"IF(OR(LEN(B340)=0,LEN(C340)=0),\"\",ROUND(B340/(C340/100)*'Base Values'!$B$12/100,0))","v":""},{"$f":"IF(LEN(B340)=0,\"\",ROUND(B340*'Base Values'!$B$14,0))","v":""},""]
[{"$f":"IF(LEN('HVI Quality Data'!A341)>0,'HVI Quality Data'!A341,\"\")","v":""},null,null,{"$f":"IF(LEN(B341)=0,\"\",ROUND($B341*'HVI Quality Data'!R341/100,0))","v":""},{"$f":"IF(LEN(B341)=0,\"\",ROUND(B341*'Base Values'!$B$16,0))","v":""},{"$f":"IF(LEN(B341)=0,\"\",ROUND(E341/2000*'Base Values'!$B$10,0))","v":""},"",{"$f":"IF(OR(LEN(B341)=0,LEN(C341)=0),\"\",ROUND(B341/(C341/100)*'Base Values'!$B$12/100,0))","v":""},{"$f":"IF(LEN(B341)=0,\"\",ROUND(B341*'Base Values'!$B$14,0))","v":""},""]
[{"$f":"IF(LEN('HVI Quality Data'!A342)>0,'HVI Quality Data'!A342,\"\")","v":""},null,null,{"$f":"IF(LEN(B342)=0,\"\",ROUND($B342*'HVI Quality Data'!R342/100,0))","v":""},{"$f":"IF(LEN(B342)=0,\"\",ROUND(B342*'Base Values'!$B$16,0))","v":""},{"$f":"IF(LEN(B342)=0,\"\",ROUND(E342/2000*'Base Values'!$B$10,0))","v":""},"",{"$f":"IF(OR(LEN(B342)=0,LEN(C342)=0),\"\",ROUND(B342/(C342/100)*'Base Values'!$B$12/100,0))","v":""},{"$f":"IF(LEN(B342)=0,\"\",ROUND(B342*'Base Values'!$B$14,0))","v":""},""]
[{"$f":"IF(LEN('HVI Quality Data'!A343)>0,'HVI Quality Data'!A343,\"\")","v":""},null,null,{"$f":"IF(LEN(B343)=0,\"\",ROUND($B343*'HVI Quality Data'!R343/100,0))","v":""},{"$f":"IF(LEN(B343)=0,\"\",ROUND(B343*'Base Values'!$B$16,0))","v":""},{"$f":"IF(LEN(B343)=0,\"\",ROUND(E343/2000*'Base Values'!$B$10,0))","v":""},"",{"$f":"IF(OR(LEN(B343)=0,LEN(C343)=0),\"\",ROUND(B343/(C343/100)*'Base Values'!$B$12/100,0))","v":""},{"$f":"IF(LEN(B343)=0,\"\",ROUND(B343*'Base Values'!$B$14,0))","v":""},""]
[{"$f":"IF(LEN('HVI Quality Data'!A344)>0,'HVI Quality Data'!A344,\"\")","v":""},null,null,{"$f":"IF(LEN(B344)=0,\"\",ROUND($B344*'HVI Quality Data'!R344/100,0))","v":""},{"$f":"IF(LEN(B344)=0,\"\",ROUND(B344*'Base Values'!$B$16,0))","v":""},{"$f":"IF(LEN(B344)=0,\"\",ROUND(E344/2000*'Base Values'!$B$10,0))","v":""},"",{"$f":"IF(OR(LEN(B344)=0,LEN(C344)=0),\"\",ROUND(B344/(C344/100)*'Base Values'!$B$12/100,0))","v":""},{"$f":"IF(LEN(B344)=0,\"\",ROUND(B344*'Base Values'!$B$14,0))","v":""},""]
[{"$f":"IF(LEN('HVI Quality Data'!A345)>0,'HVI Quality Data'!A345,\"\")","v":""},null,null,{"$f":"IF(LEN(B345)=0,\"\",ROUND($B345*'HVI Quality Data'!R345/100,0))","v":""},{"$f":"IF(LEN(B345)=0,\"\",ROUND(B345*'Base Values'!$B$16,0))","v":""},{"$f":"IF(LEN(B345)=0,\"\",ROUND(E345/2000*'Base Values'!$B$10,0))","v":""},"",{"$f":"IF(OR(LEN(B345)=0,LEN(C345)=0),\"\",ROUND(B345/(C345/100)*'Base Values'!$B$12/100,0))","v":""},{"$f":"IF(LEN(B345)=0,\"\",ROUND(B345*'Base Values'!$B$14,0))","v":""},""]
[{"$f":"IF(LEN('HVI Quality Data'!A346)>0,'HVI Quality Data'!A346,\"\")","v":""},null,null,{"$f":"IF(LEN(B346)=0,\"\",ROUND($B346*'HVI Quality Data'!R346/100,0))","v":""},{"$f":"IF(LEN(B346)=0,\"\",ROUND(B346*'Base Values'!$B$16,0))","v":""},{"$f":"IF(LEN(B346)=0,\"\",ROUND(E346/2000*'Base Values'!$B$10,0))","v":""},"",{"$f":"IF(OR(LEN(B346)=0,LEN(C346)=0),\"\",ROUND(B346/(C346/100)*'Base Values'!$B$12/100,0))","v":""},{"$f":"IF(LEN(B346)=0,\"\",ROUND(B346*'Base Values'!$B$14,0))","v":""},""]
[{"$f":"IF(LEN('HVI Quality Data'!A347)>0,'HVI Quality Data'!A347,\"\")","v":""},null,null,{"$f":"IF(LEN(B347)=0,\"\",ROUND($B347*'HVI Quality Data'!R347/100,0))","v":""},{"$f":"IF(LEN(B347)=0,\"\",ROUND(B347*'Base Values'!$B$16,0))","v":""},{"$f":"IF(LEN(B347)=0,\"\",ROUND(E347/2000*'Base Values'!$B$10,0))","v":""},"",{"$f":"IF(OR(LEN(B347)=0,LEN(C347)=0),\"\",ROUND(B347/(C347/100)*'Base Values'!$B$12/100,0))","v":""},{"$f":"IF(LEN(B347)=0,\"\",ROUND(B347*'Base Values'!$B$14,0))","v":""},""]
[{"$f":"IF(LEN('HVI Quality Data'!A348)>0,'HVI Quality Data'!A348,\"\")","v":""},null,null,{"$f":"IF(LEN(B348)=0,\"\",ROUND($B348*'HVI Quality Data'!R348/100,0))","v":""},{"$f":"IF(LEN(B348)=0,\"\",ROUND(B348*'Base Values'!$B$16,0))","v":""},{"$f":"IF(LEN(B348)=0,\"\",ROUND(E348/2000*'Base Values'!$B$10,0))","v":""},"",{"$f":"IF(OR(LEN(B348)=0,LEN(C348)=0),\"\",ROUND(B348/(C348/100)*'Base Values'!$B$12/100,0))","v":""},{"$f":"IF(LEN(B348)=0,\"\",ROUND(B348*'Base Values'!$B$14,0))","v":""},""]
[{"$f":"IF(LEN('HVI Quality Data'!A349)>0,'HVI Quality Data'!A349,\"\")","v":""},null,null,{"$f":"IF(LEN(B349)=0,\"\",ROUND($B349*'HVI Quality Data'!R349/100,0))","v":""},{"$f":"IF(LEN(B349)=0,\"\",ROUND(B349*'Base Values'!$B$16,0))","v":""},{"$f":"IF(LEN(B349)=0,\"\",ROUND(E349/2000*'Base Values'!$B$10,0))","v":""},"",{"$f":"IF(OR(LEN(B349)=0,LEN(C349)=0),\"\",ROUND(B349/(C349/100)*'Base Values'!$B$12/100,0))","v":""},{"$f":"IF(LEN(B349)=0,\"\",ROUND(B349*'Base Values'!$B$14,0))","v":""},""]
[{"$f":"IF(LEN('HVI Quality Data'!A350)>0,'HVI Quality Data'!A350,\"\")","v":""},null,null,{"$f":"IF(LEN(B350)=0,\"\",ROUND($B350*'HVI Quality Data'!R350/100,0))","v":""},{"$f":"IF(LEN(B350)=0,\"\",ROUND(B350*'Base Values'!$B$16,0))","v":""},{"$f":"IF(LEN(B350)=0,\"\",ROUND(E350/2000*'Base Values'!$B$10,0))","v":""},"",{"$f":"IF(OR(LEN(B350)=0,LEN(C350)=0),\"\",ROUND(B350/(C350/100)*'Base Values'!$B$12/100,0))","v":""},{"$f":"IF(LEN(B350)=0,\"\",ROUND(B350*'Base Values'!$B$14,0))","v":""},""]
[{"$f":"IF(LEN('HVI Quality Data'!A351)>0,'HVI Quality Data'!A351,\"\")","v":""},null,null,{"$f":"IF(LEN(B351)=0,\"\",ROUND($B351*'HVI Quality Data'!R351/100,0))","v":""},{"$f":"IF(LEN(B351)=0,\"\",ROUND(B351*'Base Values'!$B$16,0))","v":""},{"$f":"IF(LEN(B351)=0,\"\",ROUND(E351/2000*'Base Values'!$B$10,0))","v":""},"",{"$f":"IF(OR(LEN(B351)=0,LEN(C351)=0),\"\",ROUND(B351/(C351/100)*'Base Values'!$B$12/100,0))","v":""},{"$f":"IF(LEN(B351)=0,\"\",ROUND(B351*'Base Values'!$B$14,0))","v":""},""]
[{"$f":"IF(LEN('HVI Quality Data'!A352)>0,'HVI Quality Data'!A352,\"\")","v":""},null,null,{"$f":"IF(LEN(B352)=0,\"\",ROUND($B352*'HVI Quality Data'!R352/100,0))","v":""},{"$f":"IF(LEN(B352)=0,\"\",ROUND(B352*'Base Values'!$B$16,0))","v":""},{"$f":"IF(LEN(B352)=0,\"\",ROUND(E352/2000*'Base Values'!$B$10,0))","v":""},"",{"$f":"IF(OR(LEN(B352)=0,LEN(C352)=0),\"\",ROUND(B352/(C352/100)*'Base Values'!$B$12/100,0))","v":""},{"$f":"IF(LEN(B352)=0,\"\",ROUND(B352*'Base Values'!$B$14,0))","v":""},""]
[{"$f":"IF(LEN('HVI Quality Data'!A353)>0,'HVI Quality Data'!A353,\"\")","v":""},null,null,{"$f":"IF(LEN(B353)=0,\"\",ROUND($B353*'HVI Quality Data'!R353/100,0))","v":""},{"$f":"IF(LEN(B353)=0,\"\",ROUND(B353*'Base Values'!$B$16,0))","v":""},{"$f":"IF(LEN(B353)=0,\"\",ROUND(E353/2000*'Base Values'!$B$10,0))","v":""},"",{"$f":"IF(OR(LEN(B353)=0,LEN(C353)=0),\"\",ROUND(B353/(C353/100)*'Base Values'!$B$12/100,0))","v":""},{"$f":"IF(LEN(B353)=0,\"\",ROUND(B353*'Base Values'!$B$14,0))","v":""},""]
[{"$f":"IF(LEN('HVI Quality Data'!A354)>0,'HVI Quality Data'!A354,\"\")","v":""},null,null,{"$f":"IF(LEN(B354)=0,\"\",ROUND($B354*'HVI Quality Data'!R354/100,0))","v":""},{"$f":"IF(LEN(B354)=0,\"\",ROUND(B354*'Base Values'!$B$16,0))","v":""},{"$f":"IF(LEN(B354)=0,\"\",ROUND(E354/2000*'Base Values'!$B$10,0))","v":""},"",{"$f":"IF(OR(LEN(B354)=0,LEN(C354)=0),\"\",ROUND(B354/(C354/100)*'Base Values'!$B$12/100,0))","v":""},{"$f":"IF(LEN(B354)=0,\"\",ROUND(B354*'Base Values'!$B$14,0))","v":""},""]
[{"$f":"IF(LEN('HVI Quality Data'!A355)>0,'HVI Quality Data'!A355,\"\")","v":""},null,null,{"$f":"IF(LEN(B355)=0,\"\",ROUND($B355*'HVI Quality Data'!R355/100,0))","v":""},{"$f":"IF(LEN(B355)=0,\"\",ROUND(B355*'Base Values'!$B$16,0))","v":""},{"$f":"IF(LEN(B355)=0,\"\",ROUND(E355/2000*'Base Values'!$B$10,0))","v":""},"",{"$f":"IF(OR(LEN(B355)=0,LEN(C355)=0),\"\",ROUND(B355/(C355/100)*'Base Values'!$B$12/100,0))","v":""},{"$f":"IF(LEN(B355)=0,\"\",ROUND(B355*'Base Values'!$B$14,0))","v":""},""]
[{"$f":"IF(LEN('HVI Quality Data'!A356)>0,'HVI Quality Data'!A356,\"\")","v":""},null,null,{"$f":"IF(LEN(B356)=0,\"\",ROUND($B356*'HVI Quality Data'!R356/100,0))","v":""},{"$f":"IF(LEN(B356)=0,\"\",ROUND(B356*'Base Values'!$B$16,0))","v":""},{"$f":"IF(LEN(B356)=0,\"\",ROUND(E356/2000*'Base Values'!$B$10,0))","v":""},"",{"$f":"IF(OR(LEN(B356)=0,LEN(C356)=0),\"\",ROUND(B356/(C356/100)*'Base Values'!$B$12/100,0))","v":""},{"$f":"IF(LEN(B356)=0,\"\",ROUND(B356*'Base Values'!$B$14,0))","v":""},""]
[{"$f":"IF(LEN('HVI Quality Data'!A357)>0,'HVI Quality Data'!A357,\"\")","v":""},null,null,{"$f":"IF(LEN(B357)=0,\"\",ROUND($B357*'HVI Quality Data'!R357/100,0))","v":""},{"$f":"IF(LEN(B357)=0,\"\",ROUND(B357*'Base Values'!$B$16,0))","v":""},{"$f":"IF(LEN(B357)=0,\"\",ROUND(E357/2000*'Base Values'!$B$10,0))","v":""},"",{"$f":"IF(OR(LEN(B357)=0,LEN(C357)=0),\"\",ROUND(B357/(C357/100)*'Base Values'!$B$12/100,0))","v":""},{"$f":"IF(LEN(B357)=0,\"\",ROUND(B357*'Base Values'!$B$14,0))","v":""},""]
[{"$f":"IF(LEN('HVI Quality Data'!A358)>0,'HVI Quality Data'!A358,\"\")","v":""},null,null,{"$f":"IF(LEN(B358)=0,\"\",ROUND($B358*'HVI Quality Data'!R358/100,0))","v":""},{"$f":"IF(LEN(B358)=0,\"\",ROUND(B358*'Base Values'!$B$16,0))","v":""},{"$f":"IF(LEN(B358)=0,\"\",ROUND(E358/2000*'Base Values'!$B$10,0))","v":""},"",{"$f":"IF(OR(LEN(B358)=0,LEN(C358)=0),\"\",ROUND(B358/(C358/100)*'Base Values'!$B$12/100,0))","v":""},{"$f":"IF(LEN(B358)=0,\"\",ROUND(B358*'Base Values'!$B$14,0))","v":""},""]
[{"$f":"IF(LEN('HVI Quality Data'!A359)>0,'HVI Quality Data'!A359,\"\")","v":""},null,null,{"$f":"IF(LEN(B359)=0,\"\",ROUND($B359*'HVI Quality Data'!R359/100,0))","v":""},{"$f":"IF(LEN(B359)=0,\"\",ROUND(B359*'Base Values'!$B$16,0))","v":""},{"$f":"IF(LEN(B359)=0,\"\",ROUND(E359/2000*'Base Values'!$B$10,0))","v":""},"",{"$f":"IF(OR(LEN(B359)=0,LEN(C359)=0),\"\",ROUND(B359/(C359/100)*'Base Values'!$B$12/100,0))","v":""},{"$f":"IF(LEN(B359)=0,\"\",ROUND(B359*'Base Values'!$B$14,0))","v":""},""]
[{"$f":"IF(LEN('HVI Quality Data'!A360)>0,'HVI Quality Data'!A360,\"\")","v":""},null,null,{"$f":"IF(LEN(B360)=0,\"\",ROUND($B360*'HVI Quality Data'!R360/100,0))","v":""},{"$f":"IF(LEN(B360)=0,\"\",ROUND(B360*'Base Values'!$B$16,0))","v":""},{"$f":"IF(LEN(B360)=0,\"\",ROUND(E360/2000*'Base Values'!$B$10,0))","v":""},"",{"$f":"IF(OR(LEN(B360)=0,LEN(C360)=0),\"\",ROUND(B360/(C360/100)*'Base Values'!$B$12/100,0))","v":""},{"$f":"IF(LEN(B360)=0,\"\",ROUND(B360*'Base Values'!$B$14,0))","v":""},""]
[{"$f":"IF(LEN('HVI Quality Data'!A361)>0,'HVI Quality Data'!A361,\"\")","v":""},null,null,{"$f":"IF(LEN(B361)=0,\"\",ROUND($B361*'HVI Quality Data'!R361/100,0))","v":""},{"$f":"IF(LEN(B361)=0,\"\",ROUND(B361*'Base Values'!$B$16,0))","v":""},{"$f":"IF(LEN(B361)=0,\"\",ROUND(E361/2000*'Base Values'!$B$10,0))","v":""},"",{"$f":"IF(OR(LEN(B361)=0,LEN(C361)=0),\"\",ROUND(B361/(C361/100)*'Base Values'!$B$12/100,0))","v":""},{"$f":"IF(LEN(B361)=0,\"\",ROUND(B361*'Base Values'!$B$14,0))","v":""},""]
[{"$f":"IF(LEN('HVI Quality Data'!A362)>0,'HVI Quality Data'!A362,\"\")","v":""},null,null,{"$f":"IF(LEN(B362)=0,\"\",ROUND($B362*'HVI Quality Data'!R362/100,0))","v":""},{"$f":"IF(LEN(B362)=0,\"\",ROUND(B362*'Base Values'!$B$16,0))","v":""},{"$f":"IF(LEN(B362)=0,\"\",ROUND(E362/2000*'Base Values'!$B$10,0))","v":""},"",{"$f":"IF(OR(LEN(B362)=0,LEN(C362)=0),\"\",ROUND(B362/(C362/100)*'Base Values'!$B$12/100,0))","v":""},{"$f":"IF(LEN(B362)=0,\"\",ROUND(B362*'Base Values'!$B$14,0))","v":""},""]
[{"$f":"IF(LEN('HVI Quality Data'!A363)>0,'HVI Quality Data'!A363,\"\")","v":""},null,null,{"$f":"IF(LEN(B363)=0,\"\",ROUND($B363*'HVI Quality Data'!R363/100,0))","v":""},{"$f":"IF(LEN(B363)=0,\"\",ROUND(B363*'Base Values'!$B$16,0))","v":""},{"$f":"IF(LEN(B363)=0,\"\",ROUND(E363/2000*'Base Values'!$B$10,0))","v":""},"",{"$f":"IF(OR(LEN(B363)=0,LEN(C363)=0),\"\",ROUND(B363/(C363/100)*'Base Values'!$B$12/100,0))","v":""},{"$f":"IF(LEN(B363)=0,\"\",ROUND(B363*'Base Values'!$B$14,0))","v":""},""]
[{"$f":"IF(LEN('HVI Quality Data'!A364)>0,'HVI Quality Data'!A364,\"\")","v":""},null,null,{"$f":"IF(LEN(B364)=0,\"\",ROUND($B364*'HVI Quality Data'!R364/100,0))","v":""},{"$f":"IF(LEN(B364)=0,\"\",ROUND(B364*'Base Values'!$B$16,0))","v":""},{"$f":"IF(LEN(B364)=0,\"\",ROUND(E364/2000*'Base Values'!$B$10,0))","v":""},"",{"$f":"IF(OR(LEN(B364)=0,LEN(C364)=0),\"\",ROUND(B364/(C364/100)*'Base Values'!$B$12/100,0))","v":""},{"$f":"IF(LEN(B364)=0,\"\",ROUND(B364*'Base Values'!$B$14,0))","v":""},""]
[{"$f":"IF(LEN('HVI Quality Data'!A365)>0,'HVI Quality Data'!A365,\"\")","v":""},null,null,{"$f":"IF(LEN(B365)=0,\"\",ROUND($B365*'HVI Quality Data'!R365/100,0))","v":""},{"$f":"IF(LEN(B365)=0,\"\",ROUND(B365*'Base Values'!$B$16,0))","v":""},{"$f":"IF(LEN(B365)=0,\"\",ROUND(E365/2000*'Base Values'!$B$10,0))","v":""},"",{"$f":"IF(OR(LEN(B365)=0,LEN(C365)=0),\"\",ROUND(B365/(C365/100)*'Base Values'!$B$12/100,0))","v":""},{"$f":"IF(LEN(B365)=0,\"\",ROUND(B365*'Base Values'!$B$14,0))","v":""},""]
[{"$f":"IF(LEN('HVI Quality Data'!A366)>0,'HVI Quality Data'!A366,\"\")","v":""},null,null,{"$f":"IF(LEN(B366)=0,\"\",ROUND($B366*'HVI Quality Data'!R366/100,0))","v":""},{"$f":"IF(LEN(B366)=0,\"\",ROUND(B366*'Base Values'!$B$16,0))","v":""},{"$f":"IF(LEN(B366)=0,\"\",ROUND(E366/2000*'Base Values'!$B$10,0))","v":""},"",{"$f":"IF(OR(LEN(B366)=0,LEN(C366)=0),\"\",ROUND(B366/(C366/100)*'Base Values'!$B$12/100,0))","v":""},{"$f":"IF(LEN(B366)=0,\"\",ROUND(B366*'Base Values'!$B$14,0))","v":""},""]
[{"$f":"IF(LEN('HVI Quality Data'!A367)>0,'HVI Quality Data'!A367,\"\")","v":""},null,null,{"$f":"IF(LEN(B367)=0,\"\",ROUND($B367*'HVI Quality Data'!R367/100,0))","v":""},{"$f":"IF(LEN(B367)=0,\"\",ROUND(B367*'Base Values'!$B$16,0))","v":""},{"$f":"IF(LEN(B367)=0,\"\",ROUND(E367/2000*'Base Values'!$B$10,0))","v":""},"",{"$f":"IF(OR(LEN(B367)=0,LEN(C367)=0),\"\",ROUND(B367/(C367/100)*'Base Values'!$B$12/100,0))","v":""},{"$f":"IF(LEN(B367)=0,\"\",ROUND(B367*'Base Values'!$B$14,0))","v":""},""]
[{"$f":"IF(LEN('HVI Quality Data'!A368)>0,'HVI Quality Data'!A368,\"\")","v":""},null,null,{"$f":"IF(LEN(B368)=0,\"\",ROUND($B368*'HVI Quality Data'!R368/100,0))","v":""},{"$f":"IF(LEN(B368)=0,\"\",ROUND(B368*'Base Values'!$B$16,0))","v":""},{"$f":"IF(LEN(B368)=0,\"\",ROUND(E368/2000*'Base Values'!$B$10,0))","v":""},"",{"$f":"IF(OR(LEN(B368)=0,LEN(C368)=0),\"\",ROUND(B368/(C368/100)*'Base Values'!$B$12/100,0))","v":""},{"$f":"IF(LEN(B368)=0,\"\",ROUND(B368*'Base Values'!$B$14,0))","v":""},""]
[{"$f":"IF(LEN('HVI Quality Data'!A369)>0,'HVI Quality Data'!A369,\"\")","v":""},null,null,{"$f":"IF(LEN(B369)=0,\"\",ROUND($B369*'HVI Quality Data'!R369/100,0))","v":""},{"$f":"IF(LEN(B369)=0,\"\",ROUND(B369*'Base Values'!$B$16,0))","v":""},{"$f":"IF(LEN(B369)=0,\"\",ROUND(E369/2000*'Base Values'!$B$10,0))","v":""},"",{"$f":"IF(OR(LEN(B369)=0,LEN(C369)=0),\"\",ROUND(B369/(C369/100)*'Base Values'!$B$12/100,0))","v":""},{"$f":"IF(LEN(B369)=0,\"\",ROUND(B369*'Base Values'!$B$14,0))","v":""},""]
[{"$f":"IF(LEN('HVI Quality Data'!A370)>0,'HVI Quality Data'!A370,\"\")","v":""},null,null,{"$f":"IF(LEN(B370)=0,\"\",ROUND($B370*'HVI Quality Data'!R370/100,0))","v":""},{"$f":"IF(LEN(B370)=0,\"\",ROUND(B370*'Base Values'!$B$16,0))","v":""},{"$f":"IF(LEN(B370)=0,\"\",ROUND(E370/2000*'Base Values'!$B$10,0))","v":""},"",{"$f":"IF(OR(LEN(B370)=0,LEN(C370)=0),\"\",ROUND(B370/(C370/100)*'Base Values'!$B$12/100,0))","v":""},{"$f":"IF(LEN(B370)=0,\"\",ROUND(B370*'Base Values'!$B$14,0))","v":""},""]
[{"$f":"IF(LEN('HVI Quality Data'!A371)>0,'HVI Quality Data'!A371,\"\")","v":""},null,null,{"$f":"IF(LEN(B371)=0,\"\",ROUND($B371*'HVI Quality Data'!R371/100,0))","v":""},{"$f":"IF(LEN(B371)=0,\"\",ROUND(B371*'Base Values'!$B$16,0))","v":""},{"$f":"IF(LEN(B371)=0,\"\",ROUND(E371/2000*'Base Values'!$B$10,0))","v":""},"",{"$f":"IF(OR(LEN(B371)=0,LEN(C371)=0),\"\",ROUND(B371/(C371/100)*'Base Values'!$B$12/100,0))","v":""},{"$f":"IF(LEN(B371)=0,\"\",ROUND(B371*'Base Values'!$B$14,0))","v":""},""]
[{"$f":"IF(LEN('HVI Quality Data'!A372)>0,'HVI Quality Data'!A372,\"\")","v":""},null,null,{"$f":"IF(LEN(B372)=0,\"\",ROUND($B372*'HVI Quality Data'!R372/100,0))","v":""},{"$f":"IF(LEN(B372)=0,\"\",ROUND(B372*'Base Values'!$B$16,0))","v":""},{"$f":"IF(LEN(B372)=0,\"\",ROUND(E372/2000*'Base Values'!$B$10,0))","v":""},"",{"$f":"IF(OR(LEN(B372)=0,LEN(C372)=0),\"\",ROUND(B372/(C372/100)*'Base Values'!$B$12/100,0))","v":""},{"$f":"IF(LEN(B372)=0,\"\",ROUND(B372*'Base Values'!$B$14,0))","v":""},""]
[{"$f":"IF(LEN('HVI Quality Data'!A373)>0,'HVI Quality Data'!A373,\"\")","v":""},null,null,{"$f":"IF(LEN(B373)=0,\"\",ROUND($B373*'HVI Quality Data'!R373/100,0))","v":""},{"$f":"IF(LEN(B373)=0,\"\",ROUND(B373*'Base Values'!$B$16,0))","v":""},{"$f":"IF(LEN(B373)=0,\"\",ROUND(E373/2000*'Base Values'!$B$10,0))","v":""},"",{"$f":"IF(OR(LEN(B373)=0,LEN(C373)=0),\"\",ROUND(B373/(C373/100)*'Base Values'!$B$12/100,0))","v":""},{"$f":"IF(LEN(B373)=0,\"\",ROUND(B373*'Base Values'!$B$14,0))","v":""},""]
[{"$f":"IF(LEN('HVI Quality Data'!A374)>0,'HVI Quality Data'!A374,\"\")","v":""},null,null,{"$f":"IF(LEN(B374)=0,\"\",ROUND($B374*'HVI Quality Data'!R374/100,0))","v":""},{"$f":"IF(LEN(B374)=0,\"\",ROUND(B374*'Base Values'!$B$16,0))","v":""},{"$f":"IF(LEN(B374)=0,\"\",ROUND(E374/2000*'Base Values'!$B$10,0))","v":""},"",{"$f":"IF(OR(LEN(B374)=0,LEN(C374)=0),\"\",ROUND(B374/(C374/100)*'Base Values'!$B$12/100,0))","v":""},{"$f":"IF(LEN(B374)=0,\"\",ROUND(B374*'Base Values'!$B$14,0))","v":""},""]
[{"$f":"IF(LEN('HVI Quality Data'!A375)>0,'HVI Quality Data'!A375,\"\")","v":""},null,null,{"$f":"IF(LEN(B375)=0,\"\",ROUND($B375*'HVI Quality Data'!R375/100,0))","v":""},{"$f":"IF(LEN(B375)=0,\"\",ROUND(B375*'Base Values'!$B$16,0))","v":""},{"$f":"IF(LEN(B375)=0,\"\",ROUND(E375/2000*'Base Values'!$B$10,0))","v":""},"",{"$f":"IF(OR(LEN(B375)=0,LEN(C375)=0),\"\",ROUND(B375/(C375/100)*'Base Values'!$B$12/100,0))","v":""},{"$f":"IF(LEN(B375)=0,\"\",ROUND(B375*'Base Values'!$B$14,0))","v":""},""]
[{"$f":"IF(LEN('HVI Quality Data'!A376)>0,'HVI Quality Data'!A376,\"\")","v":""},null,null,{"$f":"IF(LEN(B376)=0,\"\",ROUND($B376*'HVI Quality Data'!R376/100,0))","v":""},{"$f":"IF(LEN(B376)=0,\"\",ROUND(B376*'Base Values'!$B$16,0))","v":""},{"$f":"IF(LEN(B376)=0,\"\",ROUND(E376/2000*'Base Values'!$B$10,0))","v":""},"",{"$f":"IF(OR(LEN(B376)=0,LEN(C376)=0),\"\",ROUND(B376/(C376/100)*'Base Values'!$B$12/100,0))","v":""},{"$f":"IF(LEN(B376)=0,\"\",ROUND(B376*'Base Values'!$B$14,0))","v":""},""]
[{"$f":"IF(LEN('HVI Quality Data'!A377)>0,'HVI Quality Data'!A377,\"\")","v":""},null,null,{"$f":"IF(LEN(B377)=0,\"\",ROUND($B377*'HVI Quality Data'!R377/100,0))","v":""},{"$f":"IF(LEN(B377)=0,\"\",ROUND(B377*'Base Values'!$B$16,0))","v":""},{"$f":"IF(LEN(B377)=0,\"\",ROUND(E377/2000*'Base Values'!$B$10,0))","v":""},"",{"$f":"IF(OR(LEN(B377)=0,LEN(C377)=0),\"\",ROUND(B377/(C377/100)*'Base Values'!$B$12/100,0))","v":""},{"$f":"IF(LEN(B377)=0,\"\",ROUND(B377*'Base Values'!$B$14,0))","v":""},""]
[{"$f":"IF(LEN('HVI Quality Data'!A378)>0,'HVI Quality Data'!A378,\"\")","v":""},null,null,{"$f":"IF(LEN(B378)=0,\"\",ROUND($B378*'HVI Quality Data'!R378/100,0))","v":""},{"$f":"IF(LEN(B378)=0,\"\",ROUND(B378*'Base Values'!$B$16,0))","v":""},{"$f":"IF(LEN(B378)=0,\"\",ROUND(E378/2000*'Base Values'!$B$10,0))","v":""},"",{"$f":"IF(OR(LEN(B378)=0,LEN(C378)=0),\"\",ROUND(B378/(C378/100)*'Base Values'!$B$12/100,0))","v":""},{"$f":"IF(LEN(B378)=0,\"\",ROUND(B378*'Base Values'!$B$14,0))","v":""},""]
[{"$f":"IF(LEN('HVI Quality Data'!A379)>0,'HVI Quality Data'!A379,\"\")","v":""},null,null,{"$f":"IF(LEN(B379)=0,\"\",ROUND($B379*'HVI Quality Data'!R379/100,0))","v":""},{"$f":"IF(LEN(B379)=0,\"\",ROUND(B379*'Base Values'!$B$16,0))","v":""},{"$f":"IF(LEN(B379)=0,\"\",ROUND(E379/2000*'Base Values'!$B$10,0))","v":""},"",{"$f":"IF(OR(LEN(B379)=0,LEN(C379)=0),\"\",ROUND(B379/(C379/100)*'Base Values'!$B$12/100,0))","v":""},{"$f":"IF(LEN(B379)=0,\"\",ROUND(B379*'Base Values'!$B$14,0))","v":""},""]
[{"$f":"IF(LEN('HVI Quality Data'!A380)>0,'HVI Quality Data'!A380,\"\")","v":""},null,null,{"$f":"IF(LEN(B380)=0,\"\",ROUND($B380*'HVI Quality Data'!R380/100,0))","v":""},{"$f":"IF(LEN(B380)=0,\"\",ROUND(B380*'Base Values'!$B$16,0))","v":""},{"$f":"IF(LEN(B380)=0,\"\",ROUND(E380/2000*'Base Values'!$B$10,0))","v":""},"",{"$f":"IF(OR(LEN(B380)=0,LEN(C380)=0),\"\",ROUND(B380/(C380/100)*'Base Values'!$B$12/100,0))","v":""},{"$f":"IF(LEN(B380)=0,\"\",ROUND(B380*'Base Values'!$B$14,0))","v":""},""]
[{"$f":"IF(LEN('HVI Quality Data'!A381)>0,'HVI Quality Data'!A381,\"\")","v":""},null,null,{"$f":"IF(LEN(B381)=0,\"\",ROUND($B381*'HVI Quality Data'!R381/100,0))","v":""},{"$f":"IF(LEN(B381)=0,\"\",ROUND(B381*'Base Values'!$B$16,0))","v":""},{"$f":"IF(LEN(B381)=0,\"\",ROUND(E381/2000*'Base Values'!$B$10,0))","v":""},"",{"$f":"IF(OR(LEN(B381)=0,LEN(C381)=0),\"\",ROUND(B381/(C381/100)*'Base Values'!$B$12/100,0))","v":""},{"$f":"IF(LEN(B381)=0,\"\",ROUND(B381*'Base Values'!$B$14,0))","v":""},""]
[{"$f":"IF(LEN('HVI Quality Data'!A382)>0,'HVI Quality Data'!A382,\"\")","v":""},null,null,{"$f":"IF(LEN(B382)=0,\"\",ROUND($B382*'HVI Quality Data'!R382/100,0))","v":""},{"$f":"IF(LEN(B382)=0,\"\",ROUND(B382*'Base Values'!$B$16,0))","v":""},{"$f":"IF(LEN(B382)=0,\"\",ROUND(E382/2000*'Base Values'!$B$10,0))","v":""},"",{"$f":"IF(OR(LEN(B382)=0,LEN(C382)=0),\"\",ROUND(B382/(C382/100)*'Base Values'!$B$12/100,0))","v":""},{"$f":"IF(LEN(B382)=0,\"\",ROUND(B382*'Base Values'!$B$14,0))","v":""},""]
[{"$f":"IF(LEN('HVI Quality Data'!A383)>0,'HVI Quality Data'!A383,\"\")","v":""},null,null,{"$f":"IF(LEN(B383)=0,\"\",ROUND($B383*'HVI Quality Data'!R383/100,0))","v":""},{"$f":"IF(LEN(B383)=0,\"\",ROUND(B383*'Base Values'!$B$16,0))","v":""},{"$f":"IF(LEN(B383)=0,\"\",ROUND(E383/2000*'Base Values'!$B$10,0))","v":""},"",{"$f":"IF(OR(LEN(B383)=0,LEN(C383)=0),\"\",ROUND(B383/(C383/100)*'Base Values'!$B$12/100,0))","v":""},{"$f":"IF(LEN(B383)=0,\"\",ROUND(B383*'Base Values'!$B$14,0))","v":""},""]
[{"$f":"IF(LEN('HVI Quality Data'!A384)>0,'HVI Quality Data'!A384,\"\")","v":""},null,null,{"$f":"IF(LEN(B384)=0,\"\",ROUND($B384*'HVI Quality Data'!R384/100,0))","v":""},{"$f":"IF(LEN(B384)=0,\"\",ROUND(B384*'Base Values'!$B$16,0))","v":""},{"$f":"IF(LEN(B384)=0,\"\",ROUND(E384/2000*'Base Values'!$B$10,0))","v":""},"",{"$f":"IF(OR(LEN(B384)=0,LEN(C384)=0),\"\",ROUND(B384/(C384/100)*'Base Values'!$B$12/100,0))","v":""},{"$f":"IF(LEN(B384)=0,\"\",ROUND(B384*'Base Values'!$B$14,0))","v":""},""]
[{"$f":"IF(LEN('HVI Quality Data'!A385)>0,'HVI Quality Data'!A385,\"\")","v":""},null,null,{"$f":"IF(LEN(B385)=0,\"\",ROUND($B385*'HVI Quality Data'!R385/100,0))","v":""},{"$f":"IF(LEN(B385)=0,\"\",ROUND(B385*'Base Values'!$B$16,0))","v":""},{"$f":"IF(LEN(B385)=0,\"\",ROUND(E385/2000*'Base Values'!$B$10,0))","v":""},"",{"$f":"IF(OR(LEN(B385)=0,LEN(C385)=0),\"\",ROUND(B385/(C385/100)*'Base Values'!$B$12/100,0))","v":""},{"$f":"IF(LEN(B385)=0,\"\",ROUND(B385*'Base Values'!$B$14,0))","v":""},""]
[{"$f":"IF(LEN('HVI Quality Data'!A386)>0,'HVI Quality Data'!A386,\"\")","v":""},null,null,{"$f":"IF(LEN(B386)=0,\"\",ROUND($B386*'HVI Quality Data'!R386/100,0))","v":""},{"$f":"IF(LEN(B386)=0,\"\",ROUND(B386*'Base Values'!$B$16,0))","v":""},{"$f":"IF(LEN(B386)=0,\"\",ROUND(E386/2000*'Base Values'!$B$10,0))","v":""},"",{"$f":"IF(OR(LEN(B386)=0,LEN(C386)=0),\"\",ROUND(B386/(C386/100)*'Base Values'!$B$12/100,0))","v":""},{"$f":"IF(LEN(B386)=0,\"\",ROUND(B386*'Base Values'!$B$14,0))","v":""},""]
[{"$f":"IF(LEN('HVI Quality Data'!A387)>0,'HVI Quality Data'!A387,\"\")","v":""},null,null,{"$f":"IF(LEN(B387)=0,\"\",ROUND($B387*'HVI Quality Data'!R387/100,0))","v":""},{"$f":"IF(LEN(B387)=0,\"\",ROUND(B387*'Base Values'!$B$16,0))","v":""},{"$f":"IF(LEN(B387)=0,\"\",ROUND(E387/2000*'Base Values'!$B$10,0))","v":""},"",{"$f":"IF(OR(LEN(B387)=0,LEN(C387)=0),\"\",ROUND(B387/(C387/100)*'Base Values'!$B$12/100,0))","v":""},{"$f":"IF(LEN(B387)=0,\"\",ROUND(B387*'Base Values'!$B$14,0))","v":""},""]
[{"$f":"IF(LEN('HVI Quality Data'!A388)>0,'HVI Quality Data'!A388,\"\")","v":""},null,null,{"$f":"IF(LEN(B388)=0,\"\",ROUND($B388*'HVI Quality Data'!R388/100,0))","v":""},{"$f":"IF(LEN(B388)=0,\"\",ROUND(B388*'Base Values'!$B$16,0))","v":""},{"$f":"IF(LEN(B388)=0,\"\",ROUND(E388/2000*'Base Values'!$B$10,0))","v":""},"",{"$f":"IF(OR(LEN(B388)=0,LEN(C388)=0),\"\",ROUND(B388/(C388/100)*'Base Values'!$B$12/100,0))","v":""},{"$f":"IF(LEN(B388)=0,\"\",ROUND(B388*'Base Values'!$B$14,0))","v":""},""]
[{"$f":"IF(LEN('HVI Quality Data'!A389)>0,'HVI Quality Data'!A389,\"\")","v":""},null,null,{"$f":"IF(LEN(B389)=0,\"\",ROUND($B389*'HVI Quality Data'!R389/100,0))","v":""},{"$f":"IF(LEN(B389)=0,\"\",ROUND(B389*'Base Values'!$B$16,0))","v":""},{"$f":"IF(LEN(B389)=0,\"\",ROUND(E389/2000*'Base Values'!$B$10,0))","v":""},"",{"$f":"IF(OR(LEN(B389)=0,LEN(C389)=0),\"\",ROUND(B389/(C389/100)*'Base Values'!$B$12/100,0))","v":""},{"$f":"IF(LEN(B389)=0,\"\",ROUND(B389*'Base Values'!$B$14,0))","v":""},""]
[{"$f":"IF(LEN('HVI Quality Data'!A390)>0,'HVI Quality Data'!A390,\"\")","v":""},null,null,{"$f":"IF(LEN(B390)=0,\"\",ROUND($B390*'HVI Quality Data'!R390/100,0))","v":""},{"$f":"IF(LEN(B390)=0,\"\",ROUND(B390*'Base Values'!$B$16,0))","v":""},{"$f":"IF(LEN(B390)=0,\"\",ROUND(E390/2000*'Base Values'!$B$10,0))","v":""},"",{"$f":"IF(OR(LEN(B390)=0,LEN(C390)=0),\"\",ROUND(B390/(C390/100)*'Base Values'!$B$12/100,0))","v":""},{"$f":"IF(LEN(B390)=0,\"\",ROUND(B390*'Base Values'!$B$14,0))","v":""},""]
[{"$f":"IF(LEN('HVI Quality Data'!A391)>0,'HVI Quality Data'!A391,\"\")","v":""},null,null,{"$f":"IF(LEN(B391)=0,\"\",ROUND($B391*'HVI Quality Data'!R391/100,0))","v":""},{"$f":"IF(LEN(B391)=0,\"\",ROUND(B391*'Base Values'!$B$16,0))","v":""},{"$f":"IF(LEN(B391)=0,\"\",ROUND(E391/2000*'Base Values'!$B$10,0))","v":""},"",{"$f":"IF(OR(LEN(B391)=0,LEN(C391)=0),\"\",ROUND(B391/(C391/100)*'Base Values'!$B$12/100,0))","v":""},{"$f":"IF(LEN(B391)=0,\"\",ROUND(B391*'Base Values'!$B$14,0))","v":""},""]
[{"$f":"IF(LEN('HVI Quality Data'!A392)>0,'HVI Quality Data'!A392,\"\")","v":""},null,null,{"$f":"IF(LEN(B392)=0,\"\",ROUND($B392*'HVI Quality Data'!R392/100,0))","v":""},{"$f":"IF(LEN(B392)=0,\"\",ROUND(B392*'Base Values'!$B$16,0))","v":""},{"$f":"IF(LEN(B392)=0,\"\",ROUND(E392/2000*'Base Values'!$B$10,0))","v":""},"",{"$f":"IF(OR(LEN(B392)=0,LEN(C392)=0),\"\",ROUND(B392/(C392/100)*'Base Values'!$B$12/100,0))","v":""},{"$f":"IF(LEN(B392)=0,\"\",ROUND(B392*'Base Values'!$B$14,0))","v":""},""]
[{"$f":"IF(LEN('HVI Quality Data'!A393)>0,'HVI Quality Data'!A393,\"\")","v":""},null,null,{"$f":"IF(LEN(B393)=0,\"\",ROUND($B393*'HVI Quality Data'!R393/100,0))","v":""},{"$f":"IF(LEN(B393)=0,\"\",ROUND(B393*'Base Values'!$B$16,0))","v":""},{"$f":"IF(LEN(B393)=0,\"\",ROUND(E393/2000*'Base Values'!$B$10,0))","v":""},"",{"$f":"IF(OR(LEN(B393)=0,LEN(C393)=0),\"\",ROUND(B393/(C393/100)*'Base Values'!$B$12/100,0))","v":""},{"$f":"IF(LEN(B393)=0,\"\",ROUND(B393*'Base Values'!$B$14,0))","v":""},""]
[{"$f":"IF(LEN('HVI Quality Data'!A394)>0,'HVI Quality Data'!A394,\"\")","v":""},null,null,{"$f":"IF(LEN(B394)=0,\"\",ROUND($B394*'HVI Quality Data'!R394/100,0))","v":""},{"$f":"IF(LEN(B394)=0,\"\",ROUND(B394*'Base Values'!$B$16,0))","v":""},{"$f":"IF(LEN(B394)=0,\"\",ROUND(E394/2000*'Base Values'!$B$10,0))","v":""},"",{"$f":"IF(OR(LEN(B394)=0,LEN(C394)=0),\"\",ROUND(B394/(C394/100)*'Base Values'!$B$12/100,0))","v":""},{"$f":"IF(LEN(B394)=0,\"\",ROUND(B394*'Base Values'!$B$14,0))","v":""},""]
[{"$f":"IF(LEN('HVI Quality Data'!A395)>0,'HVI Quality Data'!A395,\"\")","v":""},null,null,{"$f":"IF(LEN(B395)=0,\"\",ROUND($B395*'HVI Quality Data'!R395/100,0))","v":""},{"$f":"IF(LEN(B395)=0,\"\",ROUND(B395*'Base Values'!$B$16,0))","v":""},{"$f":"IF(LEN(B395)=0,\"\",ROUND(E395/2000*'Base Values'!$B$10,0))","v":""},"",{"$f":"IF(OR(LEN(B395)=0,LEN(C395)=0),\"\",ROUND(B395/(C395/100)*'Base Values'!$B$12/100,0))","v":""},{"$f":"IF(LEN(B395)=0,\"\",ROUND(B395*'Base Values'!$B$14,0))","v":""},""]
[{"$f":"IF(LEN('HVI Quality Data'!A396)>0,'HVI Quality Data'!A396,\"\")","v":""},null,null,{"$f":"IF(LEN(B396)=0,\"\",ROUND($B396*'HVI Quality Data'!R396/100,0))","v":""},{"$f":"IF(LEN(B396)=0,\"\",ROUND(B396*'Base Values'!$B$16,0))","v":""},{"$f":"IF(LEN(B396)=0,\"\",ROUND(E396/2000*'Base Values'!$B$10,0))","v":""},"",{"$f":"IF(OR(LEN(B396)=0,LEN(C396)=0),\"\",ROUND(B396/(C396/100)*'Base Values'!$B$12/100,0))","v":""},{"$f":"IF(LEN(B396)=0,\"\",ROUND(B396*'Base Values'!$B$14,0))","v":""},""]
[{"$f":"IF(LEN('HVI Quality Data'!A397)>0,'HVI Quality Data'!A397,\"\")","v":""},null,null,{"$f":"IF(LEN(B397)=0,\"\",ROUND($B397*'HVI Quality Data'!R397/100,0))","v":""},{"$f":"IF(LEN(B397)=0,\"\",ROUND(B397*'Base Values'!$B$16,0))","v":""},{"$f":"IF(LEN(B397)=0,\"\",ROUND(E397/2000*'Base Values'!$B$10,0))","v":""},"",{"$f":"IF(OR(LEN(B397)=0,LEN(C397)=0),\"\",ROUND(B397/(C397/100)*'Base Values'!$B$12/100,0))","v":""},{"$f":"IF(LEN(B397)=0,\"\",ROUND(B397*'Base Values'!$B$14,0))","v":""},""]
[{"$f":"IF(LEN('HVI Quality Data'!A398)>0,'HVI Quality Data'!A398,\"\")","v":""},null,null,{"$f":"IF(LEN(B398)=0,\"\",ROUND($B398*'HVI Quality Data'!R398/100,0))","v":""},{"$f":"IF(LEN(B398)=0,\"\",ROUND(B398*'Base Values'!$B$16,0))","v":""},{"$f":"IF(LEN(B398)=0,\"\",ROUND(E398/2000*'Base Values'!$B$10,0))","v":""},"",{"$f":"IF(OR(LEN(B398)=0,LEN(C398)=0),\"\",ROUND(B398/(C398/100)*'Base Values'!$B$12/100,0))","v":""},{"$f":"IF(LEN(B398)=0,\"\",ROUND(B398*'Base Values'!$B$14,0))","v":""},""]
[{"$f":"IF(LEN('HVI Quality Data'!A399)>0,'HVI Quality Data'!A399,\"\")","v":""},null,null,{"$f":"IF(LEN(B399)=0,\"\",ROUND($B399*'HVI Quality Data'!R399/100,0))","v":""},{"$f":"IF(LEN(B399)=0,\"\",ROUND(B399*'Base Values'!$B$16,0))","v":""},{"$f":"IF(LEN(B399)=0,\"\",ROUND(E399/2000*'Base Values'!$B$10,0))","v":""},"",{"$f":"IF(OR(LEN(B399)=0,LEN(C399)=0),\"\",ROUND(B399/(C399/100)*'Base Values'!$B$12/100,0))","v":""},{"$f":"IF(LEN(B399)=0,\"\",ROUND(B399*'Base Values'!$B$14,0))","v":""},""]
[{"$f":"IF(LEN('HVI Quality Data'!A400)>0,'HVI Quality Data'!A400,\"\")","v":""},null,null,{"$f":"IF(LEN(B400)=0,\"\",ROUND($B400*'HVI Quality Data'!R400/100,0))","v":""},{"$f":"IF(LEN(B400)=0,\"\",ROUND(B400*'Base Values'!$B$16,0))","v":""},{"$f":"IF(LEN(B400)=0,\"\",ROUND(E400/2000*'Base Values'!$B$10,0))","v":""},{"$f":"IF(LEN(B400)=0,\"\",SUM(D400,F400))","v":""},{"$f":"IF(OR(LEN(B400)=0,LEN(C400)=0),\"\",ROUND(B400/(C400/100)*'Base Values'!$B$12/100,0))","v":""},{"$f":"IF(LEN(B400)=0,\"\",ROUND(B400*'Base Values'!$B$14,0))","v":""},{"$f":"IF(OR(LEN(B400)=0,LEN(C400)=0),\"\",G400-H400-I400)","v":""}]
[{"$f":"IF(LEN('HVI Quality Data'!A401)>0,'HVI Quality Data'!A401,\"\")","v":""},null,null,{"$f":"IF(LEN(B401)=0,\"\",ROUND($B401*'HVI Quality Data'!R401/100,0))","v":""},{"$f":"IF(LEN(B401)=0,\"\",ROUND(B401*'Base Values'!$B$16,0))","v":""},{"$f":"IF(LEN(B401)=0,\"\",ROUND(E401/2000*'Base Values'!$B$10,0))","v":""},"",{"$f":"IF(OR(LEN(B401)=0,LEN(C401)=0),\"\",ROUND(B401/(C401/100)*'Base Values'!$B$12/100,0))","v":""},{"$f":"IF(LEN(B401)=0,\"\",ROUND(B401*'Base Values'!$B$14,0))","v":""},""]
[{"$f":"IF(LEN('HVI Quality Data'!A402)>0,'HVI Quality Data'!A402,\"\")","v":""},null,null,{"$f":"IF(LEN(B402)=0,\"\",ROUND($B402*'HVI Quality Data'!R402/100,0))","v":""},{"$f":"IF(LEN(B402)=0,\"\",ROUND(B402*'Base Values'!$B$16,0))","v":""},{"$f":"IF(LEN(B402)=0,\"\",ROUND(E402/2000*'Base Values'!$B$10,0))","v":""},"",{"$f":"IF(OR(LEN(B402)=0,LEN(C402)=0),\"\",ROUND(B402/(C402/100)*'Base Values'!$B$12/100,0))","v":""},{"$f":"IF(LEN(B402)=0,\"\",ROUND(B402*'Base Values'!$B$14,0))","v":""},""]
[{"$f":"IF(LEN('HVI Quality Data'!A403)>0,'HVI Quality Data'!A403,\"\")","v":""},null,null,{"$f":"IF(LEN(B403)=0,\"\",ROUND($B403*'HVI Quality Data'!R403/100,0))","v":""},{"$f":"IF(LEN(B403)=0,\"\",ROUND(B403*'Base Values'!$B$16,0))","v":""},{"$f":"IF(LEN(B403)=0,\"\",ROUND(E403/2000*'Base Values'!$B$10,0))","v":""},"",{"$f":"IF(OR(LEN(B403)=0,LEN(C403)=0),\"\",ROUND(B403/(C403/100)*'Base Values'!$B$12/100,0))","v":""},{"$f":"IF(LEN(B403)=0,\"\",ROUND(B403*'Base Values'!$B$14,0))","v":""},""]
[{"$f":"IF(LEN('HVI Quality Data'!A404)>0,'HVI Quality Data'!A404,\"\")","v":""},null,null,{"$f":"IF(LEN(B404)=0,\"\",ROUND($B404*'HVI Quality Data'!R404/100,0))","v":""},{"$f":"IF(LEN(B404)=0,\"\",ROUND(B404*'Base Values'!$B$16,0))","v":""},{"$f":"IF(LEN(B404)=0,\"\",ROUND(E404/2000*'Base Values'!$B$10,0))","v":""},"",{"$f":"IF(OR(LEN(B404)=0,LEN(C404)=0),\"\",ROUND(B404/(C404/100)*'Base Values'!$B$12/100,0))","v":""},{"$f":"IF(LEN(B404)=0,\"\",ROUND(B404*'Base Values'!$B$14,0))","v":""},""]
[{"$f":"IF(LEN('HVI Quality Data'!A405)>0,'HVI Quality Data'!A405,\"\")","v":""},null,null,{"$f":"IF(LEN(B405)=0,\"\",ROUND($B405*'HVI Quality Data'!R405/100,0))","v":""},{"$f":"IF(LEN(B405)=0,\"\",ROUND(B405*'Base Values'!$B$16,0))","v":""},{"$f":"IF(LEN(B405)=0,\"\",ROUND(E405/2000*'Base Values'!$B$10,0))","v":""},"",{"$f":"IF(OR(LEN(B405)=0,LEN(C405)=0),\"\",ROUND(B405/(C405/100)*'Base Values'!$B$12/100,0))","v":""},{"$f":"IF(LEN(B405)=0,\"\",ROUND(B405*'Base Values'!$B$14,0))","v":""},""]
[{"$f":"IF(LEN('HVI Quality Data'!A406)>0,'HVI Quality Data'!A406,\"\")","v":""},null,null,{"$f":"IF(LEN(B406)=0,\"\",ROUND($B406*'HVI Quality Data'!R406/100,0))","v":""},{"$f":"IF(LEN(B406)=0,\"\",ROUND(B406*'Base Values'!$B$16,0))","v":""},{"$f":"IF(LEN(B406)=0,\"\",ROUND(E406/2000*'Base Values'!$B$10,0))","v":""},"",{"$f":"IF(OR(LEN(B406)=0,LEN(C406)=0),\"\",ROUND(B406/(C406/100)*'Base Values'!$B$12/100,0))","v":""},{"$f":"IF(LEN(B406)=0,\"\",ROUND(B406*'Base Values'!$B$14,0))","v":""},""]
[{"$f":"IF(LEN('HVI Quality Data'!A407)>0,'HVI Quality Data'!A407,\"\")","v":""},null,null,{"$f":"IF(LEN(B407)=0,\"\",ROUND($B407*'HVI Quality Data'!R407/100,0))","v":""},{"$f":"IF(LEN(B407)=0,\"\",ROUND(B407*'Base Values'!$B$16,0))","v":""},{"$f":"IF(LEN(B407)=0,\"\",ROUND(E407/2000*'Base Values'!$B$10,0))","v":""},"",{"$f":"IF(OR(LEN(B407)=0,LEN(C407)=0),\"\",ROUND(B407/(C407/100)*'Base Values'!$B$12/100,0))","v":""},{"$f":"IF(LEN(B407)=0,\"\",ROUND(B407*'Base Values'!$B$14,0))","v":""},""]
[{"$f":"IF(LEN('HVI Quality Data'!A408)>0,'HVI Quality Data'!A408,\"\")","v":""},null,null,{"$f":"IF(LEN(B408)=0,\"\",ROUND($B408*'HVI Quality Data'!R408/100,0))","v":""},{"$f":"IF(LEN(B408)=0,\"\",ROUND(B408*'Base Values'!$B$16,0))","v":""},{"$f":"IF(LEN(B408)=0,\"\",ROUND(E408/2000*'Base Values'!$B$10,0))","v":""},"",{"$f":"IF(OR(LEN(B408)=0,LEN(C408)=0),\"\",ROUND(B408/(C408/100)*'Base Values'!$B$12/100,0))","v":""},{"$f":"IF(LEN(B408)=0,\"\",ROUND(B408*'Base Values'!$B$14,0))","v":""},""]
[{"$f":"IF(LEN('HVI Quality Data'!A409)>0,'HVI Quality Data'!A409,\"\")","v":""},null,null,{"$f":"IF(LEN(B409)=0,\"\",ROUND($B409*'HVI Quality Data'!R409/100,0))","v":""},{"$f":"IF(LEN(B409)=0,\"\",ROUND(B409*'Base Values'!$B$16,0))","v":""},{"$f":"IF(LEN(B409)=0,\"\",ROUND(E409/2000*'Base Values'!$B$10,0))","v":""},"",{"$f":"IF(OR(LEN(B409)=0,LEN(C409)=0),\"\",ROUND(B409/(C409/100)*'Base Values'!$B$12/100,0))","v":""},{"$f":"IF(LEN(B409)=0,\"\",ROUND(B409*'Base Values'!$B$14,0))","v":""},""]
[{"$f":"IF(LEN('HVI Quality Data'!A410)>0,'HVI Quality Data'!A410,\"\")","v":""},null,null,{"$f":"IF(LEN(B410)=0,\"\",ROUND($B410*'HVI Quality Data'!R410/100,0))","v":""},{"$f":"IF(LEN(B410)=0,\"\",ROUND(B410*'Base Values'!$B$16,0))","v":""},{"$f":"IF(LEN(B410)=0,\"\",ROUND(E410/2000*'Base Values'!$B$10,0))","v":""},"",{"$f":"IF(OR(LEN(B410)=0,LEN(C410)=0),\"\",ROUND(B410/(C410/100)*'Base Values'!$B$12/100,0))","v":""},{"$f":"IF(LEN(B410)=0,\"\",ROUND(B410*'Base Values'!$B$14,0))","v":""},""]
[{"$f":"IF(LEN('HVI Quality Data'!A411)>0,'HVI Quality Data'!A411,\"\")","v":""},null,null,{"$f":"IF(LEN(B411)=0,\"\",ROUND($B411*'HVI Quality Data'!R411/100,0))","v":""},{"$f":"IF(LEN(B411)=0,\"\",ROUND(B411*'Base Values'!$B$16,0))","v":""},{"$f":"IF(LEN(B411)=0,\"\",ROUND(E411/2000*'Base Values'!$B$10,0))","v":""},"",{"$f":"IF(OR(LEN(B411)=0,LEN(C411)=0),\"\",ROUND(B411/(C411/100)*'Base Values'!$B$12/100,0))","v":""},{"$f":"IF(LEN(B411)=0,\"\",ROUND(B411*'Base Values'!$B$14,0))","v":""},""]
[{"$f":"IF(LEN('HVI Quality Data'!A412)>0,'HVI Quality Data'!A412,\"\")","v":""},null,null,{"$f":"IF(LEN(B412)=0,\"\",ROUND($B412*'HVI Quality Data'!R412/100,0))","v":""},{"$f":"IF(LEN(B412)=0,\"\",ROUND(B412*'Base Values'!$B$16,0))","v":""},{"$f":"IF(LEN(B412)=0,\"\",ROUND(E412/2000*'Base Values'!$B$10,0))","v":""},"",{"$f":"IF(OR(LEN(B412)=0,LEN(C412)=0),\"\",ROUND(B412/(C412/100)*'Base Values'!$B$12/100,0))","v":""},{"$f":"IF(LEN(B412)=0,\"\",ROUND(B412*'Base Values'!$B$14,0))","v":""},""]
[{"$f":"IF(LEN('HVI Quality Data'!A413)>0,'HVI Quality Data'!A413,\"\")","v":""},null,null,{"$f":"IF(LEN(B413)=0,\"\",ROUND($B413*'HVI Quality Data'!R413/100,0))","v":""},{"$f":"IF(LEN(B413)=0,\"\",ROUND(B413*'Base Values'!$B$16,0))","v":""},{"$f":"IF(LEN(B413)=0,\"\",ROUND(E413/2000*'Base Values'!$B$10,0))","v":""},"",{"$f":"IF(OR(LEN(B413)=0,LEN(C413)=0),\"\",ROUND(B413/(C413/100)*'Base Values'!$B$12/100,0))","v":""},{"$f":"IF(LEN(B413)=0,\"\",ROUND(B413*'Base Values'!$B$14,0))","v":""},""]
[{"$f":"IF(LEN('HVI Quality Data'!A414)>0,'HVI Quality Data'!A414,\"\")","v":""},null,null,{"$f":"IF(LEN(B414)=0,\"\",ROUND($B414*'HVI Quality Data'!R414/100,0))","v":""},{"$f":"IF(LEN(B414)=0,\"\",ROUND(B414*'Base Values'!$B$16,0))","v":""},{"$f":"IF(LEN(B414)=0,\"\",ROUND(E414/2000*'Base Values'!$B$10,0))","v":""},"",{"$f":"IF(OR(LEN(B414)=0,LEN(C414)=0),\"\",ROUND(B414/(C414/100)*'Base Values'!$B$12/100,0))","v":""},{"$f":"IF(LEN(B414)=0,\"\",ROUND(B414*'Base Values'!$B$14,0))","v":""},""]
[{"$f":"IF(LEN('HVI Quality Data'!A415)>0,'HVI Quality Data'!A415,\"\")","v":""},null,null,{"$f":"IF(LEN(B415)=0,\"\",ROUND($B415*'HVI Quality Data'!R415/100,0))","v":""},{"$f":"IF(LEN(B415)=0,\"\",ROUND(B415*'Base Values'!$B$16,0))","v":""},{"$f":"IF(LEN(B415)=0,\"\",ROUND(E415/2000*'Base Values'!$B$10,0))","v":""},"",{"$f":"IF(OR(LEN(B415)=0,LEN(C415)=0),\"\",ROUND(B415/(C415/100)*'Base Values'!$B$12/100,0))","v":""},{"$f":"IF(LEN(B415)=0,\"\",ROUND(B415*'Base Values'!$B$14,0))","v":""},""]
[{"$f":"IF(LEN('HVI Quality Data'!A416)>0,'HVI Quality Data'!A416,\"\")","v":""},null,null,{"$f":"IF(LEN(B416)=0,\"\",ROUND($B416*'HVI Quality Data'!R416/100,0))","v":""},{"$f":"IF(LEN(B416)=0,\"\",ROUND(B416*'Base Values'!$B$16,0))","v":""},{"$f":"IF(LEN(B416)=0,\"\",ROUND(E416/2000*'Base Values'!$B$10,0))","v":""},"",{"$f":"IF(OR(LEN(B416)=0,LEN(C416)=0),\"\",ROUND(B416/(C416/100)*'Base Values'!$B$12/100,0))","v":""},{"$f":"IF(LEN(B416)=0,\"\",ROUND(B416*'Base Values'!$B$14,0))","v":""},""]
[{"$f":"IF(LEN('HVI Quality Data'!A417)>0,'HVI Quality Data'!A417,\"\")","v":""},null,null,{"$f":"IF(LEN(B417)=0,\"\",ROUND($B417*'HVI Quality Data'!R417/100,0))","v":""},{"$f":"IF(LEN(B417)=0,\"\",ROUND(B417*'Base Values'!$B$16,0))","v":""},{"$f":"IF(LEN(B417)=0,\"\",ROUND(E417/2000*'Base Values'!$B$10,0))","v":""},"",{"$f":"IF(OR(LEN(B417)=0,LEN(C417)=0),\"\",ROUND(B417/(C417/100)*'Base Values'!$B$12/100,0))","v":""},{"$f":"IF(LEN(B417)=0,\"\",ROUND(B417*'Base Values'!$B$14,0))","v":""},""]
[{"$f":"IF(LEN('HVI Quality Data'!A418)>0,'HVI Quality Data'!A418,\"\")","v":""},null,null,{"$f":"IF(LEN(B418)=0,\"\",ROUND($B418*'HVI Quality Data'!R418/100,0))","v":""},{"$f":"IF(LEN(B418)=0,\"\",ROUND(B418*'Base Values'!$B$16,0))","v":""},{"$f":"IF(LEN(B418)=0,\"\",ROUND(E418/2000*'Base Values'!$B$10,0))","v":""},"",{"$f":"IF(OR(LEN(B418)=0,LEN(C418)=0),\"\",ROUND(B418/(C418/100)*'Base Values'!$B$12/100,0))","v":""},{"$f":"IF(LEN(B418)=0,\"\",ROUND(B418*'Base Values'!$B$14,0))","v":""},""]
[{"$f":"IF(LEN('HVI Quality Data'!A419)>0,'HVI Quality Data'!A419,\"\")","v":""},null,null,{"$f":"IF(LEN(B419)=0,\"\",ROUND($B419*'HVI Quality Data'!R419/100,0))","v":""},{"$f":"IF(LEN(B419)=0,\"\",ROUND(B419*'Base Values'!$B$16,0))","v":""},{"$f":"IF(LEN(B419)=0,\"\",ROUND(E419/2000*'Base Values'!$B$10,0))","v":""},"",{"$f":"IF(OR(LEN(B419)=0,LEN(C419)=0),\"\",ROUND(B419/(C419/100)*'Base Values'!$B$12/100,0))","v":""},{"$f":"IF(LEN(B419)=0,\"\",ROUND(B419*'Base Values'!$B$14,0))","v":""},""]
[{"$f":"IF(LEN('HVI Quality Data'!A420)>0,'HVI Quality Data'!A420,\"\")","v":""},null,null,{"$f":"IF(LEN(B420)=0,\"\",ROUND($B420*'HVI Quality Data'!R420/100,0))","v":""},{"$f":"IF(LEN(B420)=0,\"\",ROUND(B420*'Base Values'!$B$16,0))","v":""},{"$f":"IF(LEN(B420)=0,\"\",ROUND(E420/2000*'Base Values'!$B$10,0))","v":""},"",{"$f":"IF(OR(LEN(B420)=0,LEN(C420)=0),\"\",ROUND(B420/(C420/100)*'Base Values'!$B$12/100,0))","v":""},{"$f":"IF(LEN(B420)=0,\"\",ROUND(B420*'Base Values'!$B$14,0))","v":""},""]
[{"$f":"IF(LEN('HVI Quality Data'!A421)>0,'HVI Quality Data'!A421,\"\")","v":""},null,null,{"$f":"IF(LEN(B421)=0,\"\",ROUND($B421*'HVI Quality Data'!R421/100,0))","v":""},{"$f":"IF(LEN(B421)=0,\"\",ROUND(B421*'Base Values'!$B$16,0))","v":""},{"$f":"IF(LEN(B421)=0,\"\",ROUND(E421/2000*'Base Values'!$B$10,0))","v":""},"",{"$f":"IF(OR(LEN(B421)=0,LEN(C421)=0),\"\",ROUND(B421/(C421/100)*'Base Values'!$B$12/100,0))","v":""},{"$f":"IF(LEN(B421)=0,\"\",ROUND(B421*'Base Values'!$B$14,0))","v":""},""]
[{"$f":"IF(LEN('HVI Quality Data'!A422)>0,'HVI Quality Data'!A422,\"\")","v":""},null,null,{"$f":"IF(LEN(B422)=0,\"\",ROUND($B422*'HVI Quality Data'!R422/100,0))","v":""},{"$f":"IF(LEN(B422)=0,\"\",ROUND(B422*'Base Values'!$B$16,0))","v":""},{"$f":"IF(LEN(B422)=0,\"\",ROUND(E422/2000*'Base Values'!$B$10,0))","v":""},"",{"$f":"IF(OR(LEN(B422)=0,LEN(C422)=0),\"\",ROUND(B422/(C422/100)*'Base Values'!$B$12/100,0))","v":""},{"$f":"IF(LEN(B422)=0,\"\",ROUND(B422*'Base Values'!$B$14,0))","v":""},""]
[{"$f":"IF(LEN('HVI Quality Data'!A423)>0,'HVI Quality Data'!A423,\"\")","v":""},null,null,{"$f":"IF(LEN(B423)=0,\"\",ROUND($B423*'HVI Quality Data'!R423/100,0))","v":""},{"$f":"IF(LEN(B423)=0,\"\",ROUND(B423*'Base Values'!$B$16,0))","v":""},{"$f":"IF(LEN(B423)=0,\"\",ROUND(E423/2000*'Base Values'!$B$10,0))","v":""},"",{"$f":"IF(OR(LEN(B423)=0,LEN(C423)=0),\"\",ROUND(B423/(C423/100)*'Base Values'!$B$12/100,0))","v":""},{"$f":"IF(LEN(B423)=0,\"\",ROUND(B423*'Base Values'!$B$14,0))","v":""},""]
[{"$f":"IF(LEN('HVI Quality Data'!A424)>0,'HVI Quality Data'!A424,\"\")","v":""},null,null,{"$f":"IF(LEN(B424)=0,\"\",ROUND($B424*'HVI Quality Data'!R424/100,0))","v":""},{"$f":"IF(LEN(B424)=0,\"\",ROUND(B424*'Base Values'!$B$16,0))","v":""},{"$f":"IF(LEN(B424)=0,\"\",ROUND(E424/2000*'Base Values'!$B$10,0))","v":""},"",{"$f":"IF(OR(LEN(B424)=0,LEN(C424)=0),\"\",ROUND(B424/(C424/100)*'Base Values'!$B$12/100,0))","v":""},{"$f":"IF(LEN(B424)=0,\"\",ROUND(B424*'Base Values'!$B$14,0))","v":""},""]
[{"$f":"IF(LEN('HVI Quality Data'!A425)>0,'HVI Quality Data'!A425,\"\")","v":""},null,null,{"$f":"IF(LEN(B425)=0,\"\",ROUND($B425*'HVI Quality Data'!R425/100,0))","v":""},{"$f":"IF(LEN(B425)=0,\"\",ROUND(B425*'Base Values'!$B$16,0))","v":""},{"$f":"IF(LEN(B425)=0,\"\",ROUND(E425/2000*'Base Values'!$B$10,0))","v":""},"",{"$f":"IF(OR(LEN(B425)=0,LEN(C425)=0),\"\",ROUND(B425/(C425/100)*'Base Values'!$B$12/100,0))","v":""},{"$f":"IF(LEN(B425)=0,\"\",ROUND(B425*'Base Values'!$B$14,0))","v":""},""]
[{"$f":"IF(LEN('HVI Quality Data'!A426)>0,'HVI Quality Data'!A426,\"\")","v":""},null,null,{"$f":"IF(LEN(B426)=0,\"\",ROUND($B426*'HVI Quality Data'!R426/100,0))","v":""},{"$f":"IF(LEN(B426)=0,\"\",ROUND(B426*'Base Values'!$B$16,0))","v":""},{"$f":"IF(LEN(B426)=0,\"\",ROUND(E426/2000*'Base Values'!$B$10,0))","v":""},"",{"$f":"IF(OR(LEN(B426)=0,LEN(C426)=0),\"\",ROUND(B426/(C426/100)*'Base Values'!$B$12/100,0))","v":""},{"$f":"IF(LEN(B426)=0,\"\",ROUND(B426*'Base Values'!$B$14,0))","v":""},""]
[{"$f":"IF(LEN('HVI Quality Data'!A427)>0,'HVI Quality Data'!A427,\"\")","v":""},null,null,{"$f":"IF(LEN(B427)=0,\"\",ROUND($B427*'HVI Quality Data'!R427/100,0))","v":""},{"$f":"IF(LEN(B427)=0,\"\",ROUND(B427*'Base Values'!$B$16,0))","v":""},{"$f":"IF(LEN(B427)=0,\"\",ROUND(E427/2000*'Base Values'!$B$10,0))","v":""},"",{"$f":"IF(OR(LEN(B427)=0,LEN(C427)=0),\"\",ROUND(B427/(C427/100)*'Base Values'!$B$12/100,0))","v":""},{"$f":"IF(LEN(B427)=0,\"\",ROUND(B427*'Base Values'!$B$14,0))","v":""},""]
[{"$f":"IF(LEN('HVI Quality Data'!A428)>0,'HVI Quality Data'!A428,\"\")","v":""},null,null,{"$f":"IF(LEN(B428)=0,\"\",ROUND($B428*'HVI Quality Data'!R428/100,0))","v":""},{"$f":"IF(LEN(B428)=0,\"\",ROUND(B428*'Base Values'!$B$16,0))","v":""},{"$f":"IF(LEN(B428)=0,\"\",ROUND(E428/2000*'Base Values'!$B$10,0))","v":""},"",{"$f":"IF(OR(LEN(B428)=0,LEN(C428)=0),\"\",ROUND(B428/(C428/100)*'Base Values'!$B$12/100,0))","v":""},{"$f":"IF(LEN(B428)=0,\"\",ROUND(B428*'Base Values'!$B$14,0))","v":""},""]
[{"$f":"IF(LEN('HVI Quality Data'!A429)>0,'HVI Quality Data'!A429,\"\")","v":""},null,null,{"$f":"IF(LEN(B429)=0,\"\",ROUND($B429*'HVI Quality Data'!R429/100,0))","v":""},{"$f":"IF(LEN(B429)=0,\"\",ROUND(B429*'Base Values'!$B$16,0))","v":""},{"$f":"IF(LEN(B429)=0,\"\",ROUND(E429/2000*'Base Values'!$B$10,0))","v":""},"",{"$f":"IF(OR(LEN(B429)=0,LEN(C429)=0),\"\",ROUND(B429/(C429/100)*'Base Values'!$B$12/100,0))","v":""},{"$f":"IF(LEN(B429)=0,\"\",ROUND(B429*'Base Values'!$B$14,0))","v":""},""]
[{"$f":"IF(LEN('HVI Quality Data'!A430)>0,'HVI Quality Data'!A430,\"\")","v":""},null,null,{"$f":"IF(LEN(B430)=0,\"\",ROUND($B430*'HVI Quality Data'!R430/100,0))","v":""},{"$f":"IF(LEN(B430)=0,\"\",ROUND(B430*'Base Values'!$B$16,0))","v":""},{"$f":"IF(LEN(B430)=0,\"\",ROUND(E430/2000*'Base Values'!$B$10,0))","v":""},"",{"$f":"IF(OR(LEN(B430)=0,LEN(C430)=0),\"\",ROUND(B430/(C430/100)*'Base Values'!$B$12/100,0))","v":""},{"$f":"IF(LEN(B430)=0,\"\",ROUND(B430*'Base Values'!$B$14,0))","v":""},""]
[{"$f":"IF(LEN('HVI Quality Data'!A431)>0,'HVI Quality Data'!A431,\"\")","v":""},null,null,{"$f":"IF(LEN(B431)=0,\"\",ROUND($B431*'HVI Quality Data'!R431/100,0))","v":""},{"$f":"IF(LEN(B431)=0,\"\",ROUND(B431*'Base Values'!$B$16,0))","v":""},{"$f":"IF(LEN(B431)=0,\"\",ROUND(E431/2000*'Base Values'!$B$10,0))","v":""},"",{"$f":"IF(OR(LEN(B431)=0,LEN(C431)=0),\"\",ROUND(B431/(C431/100)*'Base Values'!$B$12/100,0))","v":""},{"$f":"IF(LEN(B431)=0,\"\",ROUND(B431*'Base Values'!$B$14,0))","v":""},""]
[{"$f":"IF(LEN('HVI Quality Data'!A432)>0,'HVI Quality Data'!A432,\"\")","v":""},null,null,{"$f":"IF(LEN(B432)=0,\"\",ROUND($B432*'HVI Quality Data'!R432/100,0))","v":""},{"$f":"IF(LEN(B432)=0,\"\",ROUND(B432*'Base Values'!$B$16,0))","v":""},{"$f":"IF(LEN(B432)=0,\"\",ROUND(E432/2000*'Base Values'!$B$10,0))","v":""},"",{"$f":"IF(OR(LEN(B432)=0,LEN(C432)=0),\"\",ROUND(B432/(C432/100)*'Base Values'!$B$12/100,0))","v":""},{"$f":"IF(LEN(B432)=0,\"\",ROUND(B432*'Base Values'!$B$14,0))","v":""},""]
[{"$f":"IF(LEN('HVI Quality Data'!A433)>0,'HVI Quality Data'!A433,\"\")","v":""},null,null,{"$f":"IF(LEN(B433)=0,\"\",ROUND($B433*'HVI Quality Data'!R433/100,0))","v":""},{"$f":"IF(LEN(B433)=0,\"\",ROUND(B433*'Base Values'!$B$16,0))","v":""},{"$f":"IF(LEN(B433)=0,\"\",ROUND(E433/2000*'Base Values'!$B$10,0))","v":""},"",{"$f":"IF(OR(LEN(B433)=0,LEN(C433)=0),\"\",ROUND(B433/(C433/100)*'Base Values'!$B$12/100,0))","v":""},{"$f":"IF(LEN(B433)=0,\"\",ROUND(B433*'Base Values'!$B$14,0))","v":""},""]
[{"$f":"IF(LEN('HVI Quality Data'!A434)>0,'HVI Quality Data'!A434,\"\")","v":""},null,null,{"$f":"IF(LEN(B434)=0,\"\",ROUND($B434*'HVI Quality Data'!R434/100,0))","v":""},{"$f":"IF(LEN(B434)=0,\"\",ROUND(B434*'Base Values'!$B$16,0))","v":""},{"$f":"IF(LEN(B434)=0,\"\",ROUND(E434/2000*'Base Values'!$B$10,0))","v":""},"",{"$f":"IF(OR(LEN(B434)=0,LEN(C434)=0),\"\",ROUND(B434/(C434/100)*'Base Values'!$B$12/100,0))","v":""},{"$f":"IF(LEN(B434)=0,\"\",ROUND(B434*'Base Values'!$B$14,0))","v":""},""]
[{"$f":"IF(LEN('HVI Quality Data'!A435)>0,'HVI Quality Data'!A435,\"\")","v":""},null,null,{"$f":"IF(LEN(B435)=0,\"\",ROUND($B435*'HVI Quality Data'!R435/100,0))","v":""},{"$f":"IF(LEN(B435)=0,\"\",ROUND(B435*'Base Values'!$B$16,0))","v":""},{"$f":"IF(LEN(B435)=0,\"\",ROUND(E435/2000*'Base Values'!$B$10,0))","v":""},"",{"$f":"IF(OR(LEN(B435)=0,LEN(C435)=0),\"\",ROUND(B435/(C435/100)*'Base Values'!$B$12/100,0))","v":""},{"$f":"IF(LEN(B435)=0,\"\",ROUND(B435*'Base Values'!$B$14,0))","v":""},""]
[{"$f":"IF(LEN('HVI Quality Data'!A436)>0,'HVI Quality Data'!A436,\"\")","v":""},null,null,{"$f":"IF(LEN(B436)=0,\"\",ROUND($B436*'HVI Quality Data'!R436/100,0))","v":""},{"$f":"IF(LEN(B436)=0,\"\",ROUND(B436*'Base Values'!$B$16,0))","v":""},{"$f":"IF(LEN(B436)=0,\"\",ROUND(E436/2000*'Base Values'!$B$10,0))","v":""},"",{"$f":"IF(OR(LEN(B436)=0,LEN(C436)=0),\"\",ROUND(B436/(C436/100)*'Base Values'!$B$12/100,0))","v":""},{"$f":"IF(LEN(B436)=0,\"\",ROUND(B436*'Base Values'!$B$14,0))","v":""},""]
[{"$f":"IF(LEN('HVI Quality Data'!A437)>0,'HVI Quality Data'!A437,\"\")","v":""},null,null,{"$f":"IF(LEN(B437)=0,\"\",ROUND($B437*'HVI Quality Data'!R437/100,0))","v":""},{"$f":"IF(LEN(B437)=0,\"\",ROUND(B437*'Base Values'!$B$16,0))","v":""},{"$f":"IF(LEN(B437)=0,\"\",ROUND(E437/2000*'Base Values'!$B$10,0))","v":""},"",{"$f":"IF(OR(LEN(B437)=0,LEN(C437)=0),\"\",ROUND(B437/(C437/100)*'Base Values'!$B$12/100,0))","v":""},{"$f":"IF(LEN(B437)=0,\"\",ROUND(B437*'Base Values'!$B$14,0))","v":""},""]
[{"$f":"IF(LEN('HVI Quality Data'!A438)>0,'HVI Quality Data'!A438,\"\")","v":""},null,null,{"$f":"IF(LEN(B438)=0,\"\",ROUND($B438*'HVI Quality Data'!R438/100,0))","v":""},{"$f":"IF(LEN(B438)=0,\"\",ROUND(B438*'Base Values'!$B$16,0))","v":""},{"$f":"IF(LEN(B438)=0,\"\",ROUND(E438/2000*'Base Values'!$B$10,0))","v":""},"",{"$f":"IF(OR(LEN(B438)=0,LEN(C438)=0),\"\",ROUND(B438/(C438/100)*'Base Values'!$B$12/100,0))","v":""},{"$f":"IF(LEN(B438)=0,\"\",ROUND(B438*'Base Values'!$B$14,0))","v":""},""]
[{"$f":"IF(LEN('HVI Quality Data'!A439)>0,'HVI Quality Data'!A439,\"\")","v":""},null,null,{"$f":"IF(LEN(B439)=0,\"\",ROUND($B439*'HVI Quality Data'!R439/100,0))","v":""},{"$f":"IF(LEN(B439)=0,\"\",ROUND(B439*'Base Values'!$B$16,0))","v":""},{"$f":"IF(LEN(B439)=0,\"\",ROUND(E439/2000*'Base Values'!$B$10,0))","v":""},"",{"$f":"IF(OR(LEN(B439)=0,LEN(C439)=0),\"\",ROUND(B439/(C439/100)*'Base Values'!$B$12/100,0))","v":""},{"$f":"IF(LEN(B439)=0,\"\",ROUND(B439*'Base Values'!$B$14,0))","v":""},""]
[{"$f":"IF(LEN('HVI Quality Data'!A440)>0,'HVI Quality Data'!A440,\"\")","v":""},null,null,{"$f":"IF(LEN(B440)=0,\"\",ROUND($B440*'HVI Quality Data'!R440/100,0))","v":""},{"$f":"IF(LEN(B440)=0,\"\",ROUND(B440*'Base Values'!$B$16,0))","v":""},{"$f":"IF(LEN(B440)=0,\"\",ROUND(E440/2000*'Base Values'!$B$10,0))","v":""},"",{"$f":"IF(OR(LEN(B440)=0,LEN(C440)=0),\"\",ROUND(B440/(C440/100)*'Base Values'!$B$12/100,0))","v":""},{"$f":"IF(LEN(B440)=0,\"\",ROUND(B440*'Base Values'!$B$14,0))","v":""},""]
[{"$f":"IF(LEN('HVI Quality Data'!A441)>0,'HVI Quality Data'!A441,\"\")","v":""},null,null,{"$f":"IF(LEN(B441)=0,\"\",ROUND($B441*'HVI Quality Data'!R441/100,0))","v":""},{"$f":"IF(LEN(B441)=0,\"\",ROUND(B441*'Base Values'!$B$16,0))","v":""},{"$f":"IF(LEN(B441)=0,\"\",ROUND(E441/2000*'Base Values'!$B$10,0))","v":""},"",{"$f":"IF(OR(LEN(B441)=0,LEN(C441)=0),\"\",ROUND(B441/(C441/100)*'Base Values'!$B$12/100,0))","v":""},{"$f":"IF(LEN(B441)=0,\"\",ROUND(B441*'Base Values'!$B$14,0))","v":""},""]
[{"$f":"IF(LEN('HVI Quality Data'!A442)>0,'HVI Quality Data'!A442,\"\")","v":""},null,null,{"$f":"IF(LEN(B442)=0,\"\",ROUND($B442*'HVI Quality Data'!R442/100,0))","v":""},{"$f":"IF(LEN(B442)=0,\"\",ROUND(B442*'Base Values'!$B$16,0))","v":""},{"$f":"IF(LEN(B442)=0,\"\",ROUND(E442/2000*'Base Values'!$B$10,0))","v":""},"",{"$f":"IF(OR(LEN(B442)=0,LEN(C442)=0),\"\",ROUND(B442/(C442/100)*'Base Values'!$B$12/100,0))","v":""},{"$f":"IF(LEN(B442)=0,\"\",ROUND(B442*'Base Values'!$B$14,0))","v":""},""]
[{"$f":"IF(LEN('HVI Quality Data'!A443)>0,'HVI Quality Data'!A443,\"\")","v":""},null,null,{"$f":"IF(LEN(B443)=0,\"\",ROUND($B443*'HVI Quality Data'!R443/100,0))","v":""},{"$f":"IF(LEN(B443)=0,\"\",ROUND(B443*'Base Values'!$B$16,0))","v":""},{"$f":"IF(LEN(B443)=0,\"\",ROUND(E443/2000*'Base Values'!$B$10,0))","v":""},"",{"$f":"IF(OR(LEN(B443)=0,LEN(C443)=0),\"\",ROUND(B443/(C443/100)*'Base Values'!$B$12/100,0))","v":""},{"$f":"IF(LEN(B443)=0,\"\",ROUND(B443*'Base Values'!$B$14,0))","v":""},""]
[{"$f":"IF(LEN('HVI Quality Data'!A444)>0,'HVI Quality Data'!A444,\"\")","v":""},null,null,{"$f":"IF(LEN(B444)=0,\"\",ROUND($B444*'HVI Quality Data'!R444/100,0))","v":""},{"$f":"IF(LEN(B444)=0,\"\",ROUND(B444*'Base Values'!$B$16,0))","v":""},{"$f":"IF(LEN(B444)=0,\"\",ROUND(E444/2000*'Base Values'!$B$10,0))","v":""},"",{"$f":"IF(OR(LEN(B444)=0,LEN(C444)=0),\"\",ROUND(B444/(C444/100)*'Base Values'!$B$12/100,0))","v":""},{"$f":"IF(LEN(B444)=0,\"\",ROUND(B444*'Base Values'!$B$14,0))","v":""},""]
[{"$f":"IF(LEN('HVI Quality Data'!A445)>0,'HVI Quality Data'!A445,\"\")","v":""},null,null,{"$f":"IF(LEN(B445)=0,\"\",ROUND($B445*'HVI Quality Data'!R445/100,0))","v":""},{"$f":"IF(LEN(B445)=0,\"\",ROUND(B445*'Base Values'!$B$16,0))","v":""},{"$f":"IF(LEN(B445)=0,\"\",ROUND(E445/2000*'Base Values'!$B$10,0))","v":""},"",{"$f":"IF(OR(LEN(B445)=0,LEN(C445)=0),\"\",ROUND(B445/(C445/100)*'Base Values'!$B$12/100,0))","v":""},{"$f":"IF(LEN(B445)=0,\"\",ROUND(B445*'Base Values'!$B$14,0))","v":""},""]
[{"$f":"IF(LEN('HVI Quality Data'!A446)>0,'HVI Quality Data'!A446,\"\")","v":""},null,null,{"$f":"IF(LEN(B446)=0,\"\",ROUND($B446*'HVI Quality Data'!R446/100,0))","v":""},{"$f":"IF(LEN(B446)=0,\"\",ROUND(B446*'Base Values'!$B$16,0))","v":""},{"$f":"IF(LEN(B446)=0,\"\",ROUND(E446/2000*'Base Values'!$B$10,0))","v":""},"",{"$f":"IF(OR(LEN(B446)=0,LEN(C446)=0),\"\",ROUND(B446/(C446/100)*'Base Values'!$B$12/100,0))","v":""},{"$f":"IF(LEN(B446)=0,\"\",ROUND(B446*'Base Values'!$B$14,0))","v":""},""]
[{"$f":"IF(LEN('HVI Quality Data'!A447)>0,'HVI Quality Data'!A447,\"\")","v":""},null,null,{"$f":"IF(LEN(B447)=0,\"\",ROUND($B447*'HVI Quality Data'!R447/100,0))","v":""},{"$f":"IF(LEN(B447)=0,\"\",ROUND(B447*'Base Values'!$B$16,0))","v":""},{"$f":"IF(LEN(B447)=0,\"\",ROUND(E447/2000*'Base Values'!$B$10,0))","v":""},"",{"$f":"IF(OR(LEN(B447)=0,LEN(C447)=0),\"\",ROUND(B447/(C447/100)*'Base Values'!$B$12/100,0))","v":""},{"$f":"IF(LEN(B447)=0,\"\",ROUND(B447*'Base Values'!$B$14,0))","v":""},""]
[{"$f":"IF(LEN('HVI Quality Data'!A448)>0,'HVI Quality Data'!A448,\"\")","v":""},null,null,{"$f":"IF(LEN(B448)=0,\"\",ROUND($B448*'HVI Quality Data'!R448/100,0))","v":""},{"$f":"IF(LEN(B448)=0,\"\",ROUND(B448*'Base Values'!$B$16,0))","v":""},{"$f":"IF(LEN(B448)=0,\"\",ROUND(E448/2000*'Base Values'!$B$10,0))","v":""},"",{"$f":"IF(OR(LEN(B448)=0,LEN(C448)=0),\"\",ROUND(B448/(C448/100)*'Base Values'!$B$12/100,0))","v":""},{"$f":"IF(LEN(B448)=0,\"\",ROUND(B448*'Base Values'!$B$14,0))","v":""},""]
[{"$f":"IF(LEN('HVI Quality Data'!A449)>0,'HVI Quality Data'!A449,\"\")","v":""},null,null,{"$f":"IF(LEN(B449)=0,\"\",ROUND($B449*'HVI Quality Data'!R449/100,0))","v":""},{"$f":"IF(LEN(B449)=0,\"\",ROUND(B449*'Base Values'!$B$16,0))","v":""},{"$f":"IF(LEN(B449)=0,\"\",ROUND(E449/2000*'Base Values'!$B$10,0))","v":""},"",{"$f":"IF(OR(LEN(B449)=0,LEN(C449)=0),\"\",ROUND(B449/(C449/100)*'Base Values'!$B$12/100,0))","v":""},{"$f":"IF(LEN(B449)=0,\"\",ROUND(B449*'Base Values'!$B$14,0))","v":""},""]
[{"$f":"IF(LEN('HVI Quality Data'!A450)>0,'HVI Quality Data'!A450,\"\")","v":""},null,null,{"$f":"IF(LEN(B450)=0,\"\",ROUND($B450*'HVI Quality Data'!R450/100,0))","v":""},{"$f":"IF(LEN(B450)=0,\"\",ROUND(B450*'Base Values'!$B$16,0))","v":""},{"$f":"IF(LEN(B450)=0,\"\",ROUND(E450/2000*'Base Values'!$B$10,0))","v":""},"",{"$f":"IF(OR(LEN(B450)=0,LEN(C450)=0),\"\",ROUND(B450/(C450/100)*'Base Values'!$B$12/100,0))","v":""},{"$f":"IF(LEN(B450)=0,\"\",ROUND(B450*'Base Values'!$B$14,0))","v":""},""]
[{"$f":"IF(LEN('HVI Quality Data'!A451)>0,'HVI Quality Data'!A451,\"\")","v":""},null,null,{"$f":"IF(LEN(B451)=0,\"\",ROUND($B451*'HVI Quality Data'!R451/100,0))","v":""},{"$f":"IF(LEN(B451)=0,\"\",ROUND(B451*'Base Values'!$B$16,0))","v":""},{"$f":"IF(LEN(B451)=0,\"\",ROUND(E451/2000*'Base Values'!$B$10,0))","v":""},"",{"$f":"IF(OR(LEN(B451)=0,LEN(C451)=0),\"\",ROUND(B451/(C451/100)*'Base Values'!$B$12/100,0))","v":""},{"$f":"IF(LEN(B451)=0,\"\",ROUND(B451*'Base Values'!$B$14,0))","v":""},""]
[{"$f":"IF(LEN('HVI Quality Data'!A452)>0,'HVI Quality Data'!A452,\"\")","v":""},null,null,{"$f":"IF(LEN(B452)=0,\"\",ROUND($B452*'HVI Quality Data'!R452/100,0))","v":""},{"$f":"IF(LEN(B452)=0,\"\",ROUND(B452*'Base Values'!$B$16,0))","v":""},{"$f":"IF(LEN(B452)=0,\"\",ROUND(E452/2000*'Base Values'!$B$10,0))","v":""},"",{"$f":"IF(OR(LEN(B452)=0,LEN(C452)=0),\"\",ROUND(B452/(C452/100)*'Base Values'!$B$12/100,0))","v":""},{"$f":"IF(LEN(B452)=0,\"\",ROUND(B452*'Base Values'!$B$14,0))","v":""},""]
[{"$f":"IF(LEN('HVI Quality Data'!A453)>0,'HVI Quality Data'!A453,\"\")","v":""},null,null,{"$f":"IF(LEN(B453)=0,\"\",ROUND($B453*'HVI Quality Data'!R453/100,0))","v":""},{"$f":"IF(LEN(B453)=0,\"\",ROUND(B453*'Base Values'!$B$16,0))","v":""},{"$f":"IF(LEN(B453)=0,\"\",ROUND(E453/2000*'Base Values'!$B$10,0))","v":""},"",{"$f":"IF(OR(LEN(B453)=0,LEN(C453)=0),\"\",ROUND(B453/(C453/100)*'Base Values'!$B$12/100,0))","v":""},{"$f":"IF(LEN(B453)=0,\"\",ROUND(B453*'Base Values'!$B$14,0))","v":""},""]
[{"$f":"IF(LEN('HVI Quality Data'!A454)>0,'HVI Quality Data'!A454,\"\")","v":""},null,null,{"$f":"IF(LEN(B454)=0,\"\",ROUND($B454*'HVI Quality Data'!R454/100,0))","v":""},{"$f":"IF(LEN(B454)=0,\"\",ROUND(B454*'Base Values'!$B$16,0))","v":""},{"$f":"IF(LEN(B454)=0,\"\",ROUND(E454/2000*'Base Values'!$B$10,0))","v":""},"",{"$f":"IF(OR(LEN(B454)=0,LEN(C454)=0),\"\",ROUND(B454/(C454/100)*'Base Values'!$B$12/100,0))","v":""},{"$f":"IF(LEN(B454)=0,\"\",ROUND(B454*'Base Values'!$B$14,0))","v":""},""]
[{"$f":"IF(LEN('HVI Quality Data'!A455)>0,'HVI Quality Data'!A455,\"\")","v":""},null,null,{"$f":"IF(LEN(B455)=0,\"\",ROUND($B455*'HVI Quality Data'!R455/100,0))","v":""},{"$f":"IF(LEN(B455)=0,\"\",ROUND(B455*'Base Values'!$B$16,0))","v":""},{"$f":"IF(LEN(B455)=0,\"\",ROUND(E455/2000*'Base Values'!$B$10,0))","v":""},"",{"$f":"IF(OR(LEN(B455)=0,LEN(C455)=0),\"\",ROUND(B455/(C455/100)*'Base Values'!$B$12/100,0))","v":""},{"$f":"IF(LEN(B455)=0,\"\",ROUND(B455*'Base Values'!$B$14,0))","v":""},""]
[{"$f":"IF(LEN('HVI Quality Data'!A456)>0,'HVI Quality Data'!A456,\"\")","v":""},null,null,{"$f":"IF(LEN(B456)=0,\"\",ROUND($B456*'HVI Quality Data'!R456/100,0))","v":""},{"$f":"IF(LEN(B456)=0,\"\",ROUND(B456*'Base Values'!$B$16,0))","v":""},{"$f":"IF(LEN(B456)=0,\"\",ROUND(E456/2000*'Base Values'!$B$10,0))","v":""},"",{"$f":"IF(OR(LEN(B456)=0,LEN(C456)=0),\"\",ROUND(B456/(C456/100)*'Base Values'!$B$12/100,0))","v":""},{"$f":"IF(LEN(B456)=0,\"\",ROUND(B456*'Base Values'!$B$14,0))","v":""},""]
[{"$f":"IF(LEN('HVI Quality Data'!A457)>0,'HVI Quality Data'!A457,\"\")","v":""},null,null,{"$f":"IF(LEN(B457)=0,\"\",ROUND($B457*'HVI Quality Data'!R457/100,0))","v":""},{"$f":"IF(LEN(B457)=0,\"\",ROUND(B457*'Base Values'!$B$16,0))","v":""},{"$f":"IF(LEN(B457)=0,\"\",ROUND(E457/2000*'Base Values'!$B$10,0))","v":""},"",{"$f":"IF(OR(LEN(B457)=0,LEN(C457)=0),\"\",ROUND(B457/(C457/100)*'Base Values'!$B$12/100,0))","v":""},{"$f":"IF(LEN(B457)=0,\"\",ROUND(B457*'Base Values'!$B$14,0))","v":""},""]
[{"$f":"IF(LEN('HVI Quality Data'!A458)>0,'HVI Quality Data'!A458,\"\")","v":""},null,null,{"$f":"IF(LEN(B458)=0,\"\",ROUND($B458*'HVI Quality Data'!R458/100,0))","v":""},{"$f":"IF(LEN(B458)=0,\"\",ROUND(B458*'Base Values'!$B$16,0))","v":""},{"$f":"IF(LEN(B458)=0,\"\",ROUND(E458/2000*'Base Values'!$B$10,0))","v":""},"",{"$f":"IF(OR(LEN(B458)=0,LEN(C458)=0),\"\",ROUND(B458/(C458/100)*'Base Values'!$B$12/100,0))","v":""},{"$f":"IF(LEN(B458)=0,\"\",ROUND(B458*'Base Values'!$B$14,0))","v":""},""]
[{"$f":"IF(LEN('HVI Quality Data'!A459)>0,'HVI Quality Data'!A459,\"\")","v":""},null,null,{"$f":"IF(LEN(B459)=0,\"\",ROUND($B459*'HVI Quality Data'!R459/100,0))","v":""},{"$f":"IF(LEN(B459)=0,\"\",ROUND(B459*'Base Values'!$B$16,0))","v":""},{"$f":"IF(LEN(B459)=0,\"\",ROUND(E459/2000*'Base Values'!$B$10,0))","v":""},"",{"$f":"IF(OR(LEN(B459)=0,LEN(C459)=0),\"\",ROUND(B459/(C459/100)*'Base Values'!$B$12/100,0))","v":""},{"$f":"IF(LEN(B459)=0,\"\",ROUND(B459*'Base Values'!$B$14,0))","v":""},""]
[{"$f":"IF(LEN('HVI Quality Data'!A460)>0,'HVI Quality Data'!A460,\"\")","v":""},null,null,{"$f":"IF(LEN(B460)=0,\"\",ROUND($B460*'HVI Quality Data'!R460/100,0))","v":""},{"$f":"IF(LEN(B460)=0,\"\",ROUND(B460*'Base Values'!$B$16,0))","v":""},{"$f":"IF(LEN(B460)=0,\"\",ROUND(E460/2000*'Base Values'!$B$10,0))","v":""},"",{"$f":"IF(OR(LEN(B460)=0,LEN(C460)=0),\"\",ROUND(B460/(C460/100)*'Base Values'!$B$12/100,0))","v":""},{"$f":"IF(LEN(B460)=0,\"\",ROUND(B460*'Base Values'!$B$14,0))","v":""},""]
[{"$f":"IF(LEN('HVI Quality Data'!A461)>0,'HVI Quality Data'!A461,\"\")","v":""},null,null,{"$f":"IF(LEN(B461)=0,\"\",ROUND($B461*'HVI Quality Data'!R461/100,0))","v":""},{"$f":"IF(LEN(B461)=0,\"\",ROUND(B461*'Base Values'!$B$16,0))","v":""},{"$f":"IF(LEN(B461)=0,\"\",ROUND(E461/2000*'Base Values'!$B$10,0))","v":""},"",{"$f":"IF(OR(LEN(B461)=0,LEN(C461)=0),\"\",ROUND(B461/(C461/100)*'Base Values'!$B$12/100,0))","v":""},{"$f":"IF(LEN(B461)=0,\"\",ROUND(B461*'Base Values'!$B$14,0))","v":""},""]
[{"$f":"IF(LEN('HVI Quality Data'!A462)>0,'HVI Quality Data'!A462,\"\")","v":""},null,null,{"$f":"IF(LEN(B462)=0,\"\",ROUND($B462*'HVI Quality Data'!R462/100,0))","v":""},{"$f":"IF(LEN(B462)=0,\"\",ROUND(B462*'Base Values'!$B$16,0))","v":""},{"$f":"IF(LEN(B462)=0,\"\",ROUND(E462/2000*'Base Values'!$B$10,0))","v":""},"",{"$f":"IF(OR(LEN(B462)=0,LEN(C462)=0),\"\",ROUND(B462/(C462/100)*'Base Values'!$B$12/100,0))","v":""},{"$f":"IF(LEN(B462)=0,\"\",ROUND(B462*'Base Values'!$B$14,0))","v":""},""]
[{"$f":"IF(LEN('HVI Quality Data'!A463)>0,'HVI Quality Data'!A463,\"\")","v":""},null,null,{"$f":"IF(LEN(B463)=0,\"\",ROUND($B463*'HVI Quality Data'!R463/100,0))","v":""},{"$f":"IF(LEN(B463)=0,\"\",ROUND(B463*'Base Values'!$B$16,0))","v":""},{"$f":"IF(LEN(B463)=0,\"\",ROUND(E463/2000*'Base Values'!$B$10,0))","v":""},"",{"$f":"IF(OR(LEN(B463)=0,LEN(C463)=0),\"\",ROUND(B463/(C463/100)*'Base Values'!$B$12/100,0))","v":""},{"$f":"IF(LEN(B463)=0,\"\",ROUND(B463*'Base Values'!$B$14,0))","v":""},""]
[{"$f":"IF(LEN('HVI Quality Data'!A464)>0,'HVI Quality Data'!A464,\"\")","v":""},null,null,{"$f":"IF(LEN(B464)=0,\"\",ROUND($B464*'HVI Quality Data'!R464/100,0))","v":""},{"$f":"IF(LEN(B464)=0,\"\",ROUND(B464*'Base Values'!$B$16,0))","v":""},{"$f":"IF(LEN(B464)=0,\"\",ROUND(E464/2000*'Base Values'!$B$10,0))","v":""},{"$f":"IF(LEN(B464)=0,\"\",SUM(D464,F464))","v":""},{"$f":"IF(OR(LEN(B464)=0,LEN(C464)=0),\"\",ROUND(B464/(C464/100)*'Base Values'!$B$12/100,0))","v":""},{"$f":"IF(LEN(B464)=0,\"\",ROUND(B464*'Base Values'!$B$14,0))","v":""},{"$f":"IF(OR(LEN(B464)=0,LEN(C464)=0),\"\",G464-H464-I464)","v":""}]
[{"$f":"IF(LEN('HVI Quality Data'!A465)>0,'HVI Quality Data'!A465,\"\")","v":""},null,null,{"$f":"IF(LEN(B465)=0,\"\",ROUND($B465*'HVI Quality Data'!R465/100,0))","v":""},{"$f":"IF(LEN(B465)=0,\"\",ROUND(B465*'Base Values'!$B$16,0))","v":""},{"$f":"IF(LEN(B465)=0,\"\",ROUND(E465/2000*'Base Values'!$B$10,0))","v":""},"",{"$f":"IF(OR(LEN(B465)=0,LEN(C465)=0),\"\",ROUND(B465/(C465/100)*'Base Values'!$B$12/100,0))","v":""},{"$f":"IF(LEN(B465)=0,\"\",ROUND(B465*'Base Values'!$B$14,0))","v":""},""]
[{"$f":"IF(LEN('HVI Quality Data'!A466)>0,'HVI Quality Data'!A466,\"\")","v":""},null,null,{"$f":"IF(LEN(B466)=0,\"\",ROUND($B466*'HVI Quality Data'!R466/100,0))","v":""},{"$f":"IF(LEN(B466)=0,\"\",ROUND(B466*'Base Values'!$B$16,0))","v":""},{"$f":"IF(LEN(B466)=0,\"\",ROUND(E466/2000*'Base Values'!$B$10,0))","v":""},"",{"$f":"IF(OR(LEN(B466)=0,LEN(C466)=0),\"\",ROUND(B466/(C466/100)*'Base Values'!$B$12/100,0))","v":""},{"$f":"IF(LEN(B466)=0,\"\",ROUND(B466*'Base Values'!$B$14,0))","v":""},""]
[{"$f":"IF(LEN('HVI Quality Data'!A467)>0,'HVI Quality Data'!A467,\"\")","v":""},null,null,{"$f":"IF(LEN(B467)=0,\"\",ROUND($B467*'HVI Quality Data'!R467/100,0))","v":""},{"$f":"IF(LEN(B467)=0,\"\",ROUND(B467*'Base Values'!$B$16,0))","v":""},{"$f":"IF(LEN(B467)=0,\"\",ROUND(E467/2000*'Base Values'!$B$10,0))","v":""},"",{"$f":"IF(OR(LEN(B467)=0,LEN(C467)=0),\"\",ROUND(B467/(C467/100)*'Base Values'!$B$12/100,0))","v":""},{"$f":"IF(LEN(B467)=0,\"\",ROUND(B467*'Base Values'!$B$14,0))","v":""},""]
[{"$f":"IF(LEN('HVI Quality Data'!A468)>0,'HVI Quality Data'!A468,\"\")","v":""},null,null,{"$f":"IF(LEN(B468)=0,\"\",ROUND($B468*'HVI Quality Data'!R468/100,0))","v":""},{"$f":"IF(LEN(B468)=0,\"\",ROUND(B468*'Base Values'!$B$16,0))","v":""},{"$f":"IF(LEN(B468)=0,\"\",ROUND(E468/2000*'Base Values'!$B$10,0))","v":""},"",{"$f":"IF(OR(LEN(B468)=0,LEN(C468)=0),\"\",ROUND(B468/(C468/100)*'Base Values'!$B$12/100,0))","v":""},{"$f":"IF(LEN(B468)=0,\"\",ROUND(B468*'Base Values'!$B$14,0))","v":""},""]
[{"$f":"IF(LEN('HVI Quality Data'!A469)>0,'HVI Quality Data'!A469,\"\")","v":""},null,null,{"$f":"IF(LEN(B469)=0,\"\",ROUND($B469*'HVI Quality Data'!R469/100,0))","v":""},{"$f":"IF(LEN(B469)=0,\"\",ROUND(B469*'Base Values'!$B$16,0))","v":""},{"$f":"IF(LEN(B469)=0,\"\",ROUND(E469/2000*'Base Values'!$B$10,0))","v":""},"",{"$f":"IF(OR(LEN(B469)=0,LEN(C469)=0),\"\",ROUND(B469/(C469/100)*'Base Values'!$B$12/100,0))","v":""},{"$f":"IF(LEN(B469)=0,\"\",ROUND(B469*'Base Values'!$B$14,0))","v":""},""]
[{"$f":"IF(LEN('HVI Quality Data'!A470)>0,'HVI Quality Data'!A470,\"\")","v":""},null,null,{"$f":"IF(LEN(B470)=0,\"\",ROUND($B470*'HVI Quality Data'!R470/100,0))","v":""},{"$f":"IF(LEN(B470)=0,\"\",ROUND(B470*'Base Values'!$B$16,0))","v":""},{"$f":"IF(LEN(B470)=0,\"\",ROUND(E470/2000*'Base Values'!$B$10,0))","v":""},"",{"$f":"IF(OR(LEN(B470)=0,LEN(C470)=0),\"\",ROUND(B470/(C470/100)*'Base Values'!$B$12/100,0))","v":""},{"$f":"IF(LEN(B470)=0,\"\",ROUND(B470*'Base Values'!$B$14,0))","v":""},""]
[{"$f":"IF(LEN('HVI Quality Data'!A471)>0,'HVI Quality Data'!A471,\"\")","v":""},null,null,{"$f":"IF(LEN(B471)=0,\"\",ROUND($B471*'HVI Quality Data'!R471/100,0))","v":""},{"$f":"IF(LEN(B471)=0,\"\",ROUND(B471*'Base Values'!$B$16,0))","v":""},{"$f":"IF(LEN(B471)=0,\"\",ROUND(E471/2000*'Base Values'!$B$10,0))","v":""},"",{"$f":"IF(OR(LEN(B471)=0,LEN(C471)=0),\"\",ROUND(B471/(C471/100)*'Base Values'!$B$12/100,0))","v":""},{"$f":"IF(LEN(B471)=0,\"\",ROUND(B471*'Base Values'!$B$14,0))","v":""},""]
[{"$f":"IF(LEN('HVI Quality Data'!A472)>0,'HVI Quality Data'!A472,\"\")","v":""},null,null,{"$f":"IF(LEN(B472)=0,\"\",ROUND($B472*'HVI Quality Data'!R472/100,0))","v":""},{"$f":"IF(LEN(B472)=0,\"\",ROUND(B472*'Base Values'!$B$16,0))","v":""},{"$f":"IF(LEN(B472)=0,\"\",ROUND(E472/2000*'Base Values'!$B$10,0))","v":""},"",{"$f":"IF(OR(LEN(B472)=0,LEN(C472)=0),\"\",ROUND(B472/(C472/100)*'Base Values'!$B$12/100,0))","v":""},{"$f":"IF(LEN(B472)=0,\"\",ROUND(B472*'Base Values'!$B$14,0))","v":""},""]
[{"$f":"IF(LEN('HVI Quality Data'!A473)>0,'HVI Quality Data'!A473,\"\")","v":""},null,null,{"$f":"IF(LEN(B473)=0,\"\",ROUND($B473*'HVI Quality Data'!R473/100,0))","v":""},{"$f":"IF(LEN(B473)=0,\"\",ROUND(B473*'Base Values'!$B$16,0))","v":""},{"$f":"IF(LEN(B473)=0,\"\",ROUND(E473/2000*'Base Values'!$B$10,0))","v":""},"",{"$f":"IF(OR(LEN(B473)=0,LEN(C473)=0),\"\",ROUND(B473/(C473/100)*'Base Values'!$B$12/100,0))","v":""},{"$f":"IF(LEN(B473)=0,\"\",ROUND(B473*'Base Values'!$B$14,0))","v":""},""]
[{"$f":"IF(LEN('HVI Quality Data'!A474)>0,'HVI Quality Data'!A474,\"\")","v":""},null,null,{"$f":"IF(LEN(B474)=0,\"\",ROUND($B474*'HVI Quality Data'!R474/100,0))","v":""},{"$f":"IF(LEN(B474)=0,\"\",ROUND(B474*'Base Values'!$B$16,0))","v":""},{"$f":"IF(LEN(B474)=0,\"\",ROUND(E474/2000*'Base Values'!$B$10,0))","v":""},"",{"$f":"IF(OR(LEN(B474)=0,LEN(C474)=0),\"\",ROUND(B474/(C474/100)*'Base Values'!$B$12/100,0))","v":""},{"$f":"IF(LEN(B474)=0,\"\",ROUND(B474*'Base Values'!$B$14,0))","v":""},""]
[{"$f":"IF(LEN('HVI Quality Data'!A475)>0,'HVI Quality Data'!A475,\"\")","v":""},null,null,{"$f":"IF(LEN(B475)=0,\"\",ROUND($B475*'HVI Quality Data'!R475/100,0))","v":""},{"$f":"IF(LEN(B475)=0,\"\",ROUND(B475*'Base Values'!$B$16,0))","v":""},{"$f":"IF(LEN(B475)=0,\"\",ROUND(E475/2000*'Base Values'!$B$10,0))","v":""},"",{"$f":"IF(OR(LEN(B475)=0,LEN(C475)=0),\"\",ROUND(B475/(C475/100)*'Base Values'!$B$12/100,0))","v":""},{"$f":"IF(LEN(B475)=0,\"\",ROUND(B475*'Base Values'!$B$14,0))","v":""},""]
[{"$f":"IF(LEN('HVI Quality Data'!A476)>0,'HVI Quality Data'!A476,\"\")","v":""},null,null,{"$f":"IF(LEN(B476)=0,\"\",ROUND($B476*'HVI Quality Data'!R476/100,0))","v":""},{"$f":"IF(LEN(B476)=0,\"\",ROUND(B476*'Base Values'!$B$16,0))","v":""},{"$f":"IF(LEN(B476)=0,\"\",ROUND(E476/2000*'Base Values'!$B$10,0))","v":""},"",{"$f":"IF(OR(LEN(B476)=0,LEN(C476)=0),\"\",ROUND(B476/(C476/100)*'Base Values'!$B$12/100,0))","v":""},{"$f":"IF(LEN(B476)=0,\"\",ROUND(B476*'Base Values'!$B$14,0))","v":""},""]
[{"$f":"IF(LEN('HVI Quality Data'!A477)>0,'HVI Quality Data'!A477,\"\")","v":""},null,null,{"$f":"IF(LEN(B477)=0,\"\",ROUND($B477*'HVI Quality Data'!R477/100,0))","v":""},{"$f":"IF(LEN(B477)=0,\"\",ROUND(B477*'Base Values'!$B$16,0))","v":""},{"$f":"IF(LEN(B477)=0,\"\",ROUND(E477/2000*'Base Values'!$B$10,0))","v":""},"",{"$f":"IF(OR(LEN(B477)=0,LEN(C477)=0),\"\",ROUND(B477/(C477/100)*'Base Values'!$B$12/100,0))","v":""},{"$f":"IF(LEN(B477)=0,\"\",ROUND(B477*'Base Values'!$B$14,0))","v":""},""]
[{"$f":"IF(LEN('HVI Quality Data'!A478)>0,'HVI Quality Data'!A478,\"\")","v":""},null,null,{"$f":"IF(LEN(B478)=0,\"\",ROUND($B478*'HVI Quality Data'!R478/100,0))","v":""},{"$f":"IF(LEN(B478)=0,\"\",ROUND(B478*'Base Values'!$B$16,0))","v":""},{"$f":"IF(LEN(B478)=0,\"\",ROUND(E478/2000*'Base Values'!$B$10,0))","v":""},"",{"$f":"IF(OR(LEN(B478)=0,LEN(C478)=0),\"\",ROUND(B478/(C478/100)*'Base Values'!$B$12/100,0))","v":""},{"$f":"IF(LEN(B478)=0,\"\",ROUND(B478*'Base Values'!$B$14,0))","v":""},""]
[{"$f":"IF(LEN('HVI Quality Data'!A479)>0,'HVI Quality Data'!A479,\"\")","v":""},null,null,{"$f":"IF(LEN(B479)=0,\"\",ROUND($B479*'HVI Quality Data'!R479/100,0))","v":""},{"$f":"IF(LEN(B479)=0,\"\",ROUND(B479*'Base Values'!$B$16,0))","v":""},{"$f":"IF(LEN(B479)=0,\"\",ROUND(E479/2000*'Base Values'!$B$10,0))","v":""},"",{"$f":"IF(OR(LEN(B479)=0,LEN(C479)=0),\"\",ROUND(B479/(C479/100)*'Base Values'!$B$12/100,0))","v":""},{"$f":"IF(LEN(B479)=0,\"\",ROUND(B479*'Base Values'!$B$14,0))","v":""},""]
[{"$f":"IF(LEN('HVI Quality Data'!A480)>0,'HVI Quality Data'!A480,\"\")","v":""},null,null,{"$f":"IF(LEN(B480)=0,\"\",ROUND($B480*'HVI Quality Data'!R480/100,0))","v":""},{"$f":"IF(LEN(B480)=0,\"\",ROUND(B480*'Base Values'!$B$16,0))","v":""},{"$f":"IF(LEN(B480)=0,\"\",ROUND(E480/2000*'Base Values'!$B$10,0))","v":""},"",{"$f":"IF(OR(LEN(B480)=0,LEN(C480)=0),\"\",ROUND(B480/(C480/100)*'Base Values'!$B$12/100,0))","v":""},{"$f":"IF(LEN(B480)=0,\"\",ROUND(B480*'Base Values'!$B$14,0))","v":""},""]
[{"$f":"IF(LEN('HVI Quality Data'!A481)>0,'HVI Quality Data'!A481,\"\")","v":""},null,null,{"$f":"IF(LEN(B481)=0,\"\",ROUND($B481*'HVI Quality Data'!R481/100,0))","v":""},{"$f":"IF(LEN(B481)=0,\"\",ROUND(B481*'Base Values'!$B$16,0))","v":""},{"$f":"IF(LEN(B481)=0,\"\",ROUND(E481/2000*'Base Values'!$B$10,0))","v":""},"",{"$f":"IF(OR(LEN(B481)=0,LEN(C481)=0),\"\",ROUND(B481/(C481/100)*'Base Values'!$B$12/100,0))","v":""},{"$f":"IF(LEN(B481)=0,\"\",ROUND(B481*'Base Values'!$B$14,0))","v":""},""]
[{"$f":"IF(LEN('HVI Quality Data'!A482)>0,'HVI Quality Data'!A482,\"\")","v":""},null,null,{"$f":"IF(LEN(B482)=0,\"\",ROUND($B482*'HVI Quality Data'!R482/100,0))","v":""},{"$f":"IF(LEN(B482)=0,\"\",ROUND(B482*'Base Values'!$B$16,0))","v":""},{"$f":"IF(LEN(B482)=0,\"\",ROUND(E482/2000*'Base Values'!$B$10,0))","v":""},"",{"$f":"IF(OR(LEN(B482)=0,LEN(C482)=0),\"\",ROUND(B482/(C482/100)*'Base Values'!$B$12/100,0))","v":""},{"$f":"IF(LEN(B482)=0,\"\",ROUND(B482*'Base Values'!$B$14,0))","v":""},""]
[{"$f":"IF(LEN('HVI Quality Data'!A483)>0,'HVI Quality Data'!A483,\"\")","v":""},null,null,{"$f":"IF(LEN(B483)=0,\"\",ROUND($B483*'HVI Quality Data'!R483/100,0))","v":""},{"$f":"IF(LEN(B483)=0,\"\",ROUND(B483*'Base Values'!$B$16,0))","v":""},{"$f":"IF(LEN(B483)=0,\"\",ROUND(E483/2000*'Base Values'!$B$10,0))","v":""},"",{"$f":"IF(OR(LEN(B483)=0,LEN(C483)=0),\"\",ROUND(B483/(C483/100)*'Base Values'!$B$12/100,0))","v":""},{"$f":"IF(LEN(B483)=0,\"\",ROUND(B483*'Base Values'!$B$14,0))","v":""},""]
[{"$f":"IF(LEN('HVI Quality Data'!A484)>0,'HVI Quality Data'!A484,\"\")","v":""},null,null,{"$f":"IF(LEN(B484)=0,\"\",ROUND($B484*'HVI Quality Data'!R484/100,0))","v":""},{"$f":"IF(LEN(B484)=0,\"\",ROUND(B484*'Base Values'!$B$16,0))","v":""},{"$f":"IF(LEN(B484)=0,\"\",ROUND(E484/2000*'Base Values'!$B$10,0))","v":""},"",{"$f":"IF(OR(LEN(B484)=0,LEN(C484)=0),\"\",ROUND(B484/(C484/100)*'Base Values'!$B$12/100,0))","v":""},{"$f":"IF(LEN(B484)=0,\"\",ROUND(B484*'Base Values'!$B$14,0))","v":""},""]
[{"$f":"IF(LEN('HVI Quality Data'!A485)>0,'HVI Quality Data'!A485,\"\")","v":""},null,null,{"$f":"IF(LEN(B485)=0,\"\",ROUND($B485*'HVI Quality Data'!R485/100,0))","v":""},{"$f":"IF(LEN(B485)=0,\"\",ROUND(B485*'Base Values'!$B$16,0))","v":""},{"$f":"IF(LEN(B485)=0,\"\",ROUND(E485/2000*'Base Values'!$B$10,0))","v":""},"",{"$f":"IF(OR(LEN(B485)=0,LEN(C485)=0),\"\",ROUND(B485/(C485/100)*'Base Values'!$B$12/100,0))","v":""},{"$f":"IF(LEN(B485)=0,\"\",ROUND(B485*'Base Values'!$B$14,0))","v":""},""]
[{"$f":"IF(LEN('HVI Quality Data'!A486)>0,'HVI Quality Data'!A486,\"\")","v":""},null,null,{"$f":"IF(LEN(B486)=0,\"\",ROUND($B486*'HVI Quality Data'!R486/100,0))","v":""},{"$f":"IF(LEN(B486)=0,\"\",ROUND(B486*'Base Values'!$B$16,0))","v":""},{"$f":"IF(LEN(B486)=0,\"\",ROUND(E486/2000*'Base Values'!$B$10,0))","v":""},"",{"$f":"IF(OR(LEN(B486)=0,LEN(C486)=0),\"\",ROUND(B486/(C486/100)*'Base Values'!$B$12/100,0))","v":""},{"$f":"IF(LEN(B486)=0,\"\",ROUND(B486*'Base Values'!$B$14,0))","v":""},""]
[{"$f":"IF(LEN('HVI Quality Data'!A487)>0,'HVI Quality Data'!A487,\"\")","v":""},null,null,{"$f":"IF(LEN(B487)=0,\"\",ROUND($B487*'HVI Quality Data'!R487/100,0))","v":""},{"$f":"IF(LEN(B487)=0,\"\",ROUND(B487*'Base Values'!$B$16,0))","v":""},{"$f":"IF(LEN(B487)=0,\"\",ROUND(E487/2000*'Base Values'!$B$10,0))","v":""},"",{"$f":"IF(OR(LEN(B487)=0,LEN(C487)=0),\"\",ROUND(B487/(C487/100)*'Base Values'!$B$12/100,0))","v":""},{"$f":"IF(LEN(B487)=0,\"\",ROUND(B487*'Base Values'!$B$14,0))","v":""},""]
[{"$f":"IF(LEN('HVI Quality Data'!A488)>0,'HVI Quality Data'!A488,\"\")","v":""},null,null,{"$f":"IF(LEN(B488)=0,\"\",ROUND($B488*'HVI Quality Data'!R488/100,0))","v":""},{"$f":"IF(LEN(B488)=0,\"\",ROUND(B488*'Base Values'!$B$16,0))","v":""},{"$f":"IF(LEN(B488)=0,\"\",ROUND(E488/2000*'Base Values'!$B$10,0))","v":""},"",{"$f":"IF(OR(LEN(B488)=0,LEN(C488)=0),\"\",ROUND(B488/(C488/100)*'Base Values'!$B$12/100,0))","v":""},{"$f":"IF(LEN(B488)=0,\"\",ROUND(B488*'Base Values'!$B$14,0))","v":""},""]
[{"$f":"IF(LEN('HVI Quality Data'!A489)>0,'HVI Quality Data'!A489,\"\")","v":""},null,null,{"$f":"IF(LEN(B489)=0,\"\",ROUND($B489*'HVI Quality Data'!R489/100,0))","v":""},{"$f":"IF(LEN(B489)=0,\"\",ROUND(B489*'Base Values'!$B$16,0))","v":""},{"$f":"IF(LEN(B489)=0,\"\",ROUND(E489/2000*'Base Values'!$B$10,0))","v":""},"",{"$f":"IF(OR(LEN(B489)=0,LEN(C489)=0),\"\",ROUND(B489/(C489/100)*'Base Values'!$B$12/100,0))","v":""},{"$f":"IF(LEN(B489)=0,\"\",ROUND(B489*'Base Values'!$B$14,0))","v":""},""]
[{"$f":"IF(LEN('HVI Quality Data'!A490)>0,'HVI Quality Data'!A490,\"\")","v":""},null,null,{"$f":"IF(LEN(B490)=0,\"\",ROUND($B490*'HVI Quality Data'!R490/100,0))","v":""},{"$f":"IF(LEN(B490)=0,\"\",ROUND(B490*'Base Values'!$B$16,0))","v":""},{"$f":"IF(LEN(B490)=0,\"\",ROUND(E490/2000*'Base Values'!$B$10,0))","v":""},"",{"$f":"IF(OR(LEN(B490)=0,LEN(C490)=0),\"\",ROUND(B490/(C490/100)*'Base Values'!$B$12/100,0))","v":""},{"$f":"IF(LEN(B490)=0,\"\",ROUND(B490*'Base Values'!$B$14,0))","v":""},""]
[{"$f":"IF(LEN('HVI Quality Data'!A491)>0,'HVI Quality Data'!A491,\"\")","v":""},null,null,{"$f":"IF(LEN(B491)=0,\"\",ROUND($B491*'HVI Quality Data'!R491/100,0))","v":""},{"$f":"IF(LEN(B491)=0,\"\",ROUND(B491*'Base Values'!$B$16,0))","v":""},{"$f":"IF(LEN(B491)=0,\"\",ROUND(E491/2000*'Base Values'!$B$10,0))","v":""},"",{"$f":"IF(OR(LEN(B491)=0,LEN(C491)=0),\"\",ROUND(B491/(C491/100)*'Base Values'!$B$12/100,0))","v":""},{"$f":"IF(LEN(B491)=0,\"\",ROUND(B491*'Base Values'!$B$14,0))","v":""},""]
[{"$f":"IF(LEN('HVI Quality Data'!A492)>0,'HVI Quality Data'!A492,\"\")","v":""},null,null,{"$f":"IF(LEN(B492)=0,\"\",ROUND($B492*'HVI Quality Data'!R492/100,0))","v":""},{"$f":"IF(LEN(B492)=0,\"\",ROUND(B492*'Base Values'!$B$16,0))","v":""},{"$f":"IF(LEN(B492)=0,\"\",ROUND(E492/2000*'Base Values'!$B$10,0))","v":""},"",{"$f":"IF(OR(LEN(B492)=0,LEN(C492)=0),\"\",ROUND(B492/(C492/100)*'Base Values'!$B$12/100,0))","v":""},{"$f":"IF(LEN(B492)=0,\"\",ROUND(B492*'Base Values'!$B$14,0))","v":""},""]
[{"$f":"IF(LEN('HVI Quality Data'!A493)>0,'HVI Quality Data'!A493,\"\")","v":""},null,null,{"$f":"IF(LEN(B493)=0,\"\",ROUND($B493*'HVI Quality Data'!R493/100,0))","v":""},{"$f":"IF(LEN(B493)=0,\"\",ROUND(B493*'Base Values'!$B$16,0))","v":""},{"$f":"IF(LEN(B493)=0,\"\",ROUND(E493/2000*'Base Values'!$B$10,0))","v":""},"",{"$f":"IF(OR(LEN(B493)=0,LEN(C493)=0),\"\",ROUND(B493/(C493/100)*'Base Values'!$B$12/100,0))","v":""},{"$f":"IF(LEN(B493)=0,\"\",ROUND(B493*'Base Values'!$B$14,0))","v":""},""]
[{"$f":"IF(LEN('HVI Quality Data'!A494)>0,'HVI Quality Data'!A494,\"\")","v":""},null,null,{"$f":"IF(LEN(B494)=0,\"\",ROUND($B494*'HVI Quality Data'!R494/100,0))","v":""},{"$f":"IF(LEN(B494)=0,\"\",ROUND(B494*'Base Values'!$B$16,0))","v":""},{"$f":"IF(LEN(B494)=0,\"\",ROUND(E494/2000*'Base Values'!$B$10,0))","v":""},"",{"$f":"IF(OR(LEN(B494)=0,LEN(C494)=0),\"\",ROUND(B494/(C494/100)*'Base Values'!$B$12/100,0))","v":""},{"$f":"IF(LEN(B494)=0,\"\",ROUND(B494*'Base Values'!$B$14,0))","v":""},""]
[{"$f":"IF(LEN('HVI Quality Data'!A495)>0,'HVI Quality Data'!A495,\"\")","v":""},null,null,{"$f":"IF(LEN(B495)=0,\"\",ROUND($B495*'HVI Quality Data'!R495/100,0))","v":""},{"$f":"IF(LEN(B495)=0,\"\",ROUND(B495*'Base Values'!$B$16,0))","v":""},{"$f":"IF(LEN(B495)=0,\"\",ROUND(E495/2000*'Base Values'!$B$10,0))","v":""},"",{"$f":"IF(OR(LEN(B495)=0,LEN(C495)=0),\"\",ROUND(B495/(C495/100)*'Base Values'!$B$12/100,0))","v":""},{"$f":"IF(LEN(B495)=0,\"\",ROUND(B495*'Base Values'!$B$14,0))","v":""},""]
[{"$f":"IF(LEN('HVI Quality Data'!A496)>0,'HVI Quality Data'!A496,\"\")","v":""},null,null,{"$f":"IF(LEN(B496)=0,\"\",ROUND($B496*'HVI Quality Data'!R496/100,0))","v":""},{"$f":"IF(LEN(B496)=0,\"\",ROUND(B496*'Base Values'!$B$16,0))","v":""},{"$f":"IF(LEN(B496)=0,\"\",ROUND(E496/2000*'Base Values'!$B$10,0))","v":""},"",{"$f":"IF(OR(LEN(B496)=0,LEN(C496)=0),\"\",ROUND(B496/(C496/100)*'Base Values'!$B$12/100,0))","v":""},{"$f":"IF(LEN(B496)=0,\"\",ROUND(B496*'Base Values'!$B$14,0))","v":""},""]
[{"$f":"IF(LEN('HVI Quality Data'!A497)>0,'HVI Quality Data'!A497,\"\")","v":""},null,null,{"$f":"IF(LEN(B497)=0,\"\",ROUND($B497*'HVI Quality Data'!R497/100,0))","v":""},{"$f":"IF(LEN(B497)=0,\"\",ROUND(B497*'Base Values'!$B$16,0))","v":""},{"$f":"IF(LEN(B497)=0,\"\",ROUND(E497/2000*'Base Values'!$B$10,0))","v":""},"",{"$f":"IF(OR(LEN(B497)=0,LEN(C497)=0),\"\",ROUND(B497/(C497/100)*'Base Values'!$B$12/100,0))","v":""},{"$f":"IF(LEN(B497)=0,\"\",ROUND(B497*'Base Values'!$B$14,0))","v":""},""]
[{"$f":"IF(LEN('HVI Quality Data'!A498)>0,'HVI Quality Data'!A498,\"\")","v":""},null,null,{"$f":"IF(LEN(B498)=0,\"\",ROUND($B498*'HVI Quality Data'!R498/100,0))","v":""},{"$f":"IF(LEN(B498)=0,\"\",ROUND(B498*'Base Values'!$B$16,0))","v":""},{"$f":"IF(LEN(B498)=0,\"\",ROUND(E498/2000*'Base Values'!$B$10,0))","v":""},"",{"$f":"IF(OR(LEN(B498)=0,LEN(C498)=0),\"\",ROUND(B498/(C498/100)*'Base Values'!$B$12/100,0))","v":""},{"$f":"IF(LEN(B498)=0,\"\",ROUND(B498*'Base Values'!$B$14,0))","v":""},""]
[{"$f":"IF(LEN('HVI Quality Data'!A499)>0,'HVI Quality Data'!A499,\"\")","v":""},null,null,{"$f":"IF(LEN(B499)=0,\"\",ROUND($B499*'HVI Quality Data'!R499/100,0))","v":""},{"$f":"IF(LEN(B499)=0,\"\",ROUND(B499*'Base Values'!$B$16,0))","v":""},{"$f":"IF(LEN(B499)=0,\"\",ROUND(E499/2000*'Base Values'!$B$10,0))","v":""},"",{"$f":"IF(OR(LEN(B499)=0,LEN(C499)=0),\"\",ROUND(B499/(C499/100)*'Base Values'!$B$12/100,0))","v":""},{"$f":"IF(LEN(B499)=0,\"\",ROUND(B499*'Base Values'!$B$14,0))","v":""},""]
[{"$f":"IF(LEN('HVI Quality Data'!A500)>0,'HVI Quality Data'!A500,\"\")","v":""},null,null,{"$f":"IF(LEN(B500)=0,\"\",ROUND($B500*'HVI Quality Data'!R500/100,0))","v":""},{"$f":"IF(LEN(B500)=0,\"\",ROUND(B500*'Base Values'!$B$16,0))","v":""},{"$f":"IF(LEN(B500)=0,\"\",ROUND(E500/2000*'Base Values'!$B$10,0))","v":""},"",{"$f":"IF(OR(LEN(B500)=0,LEN(C500)=0),\"\",ROUND(B500/(C500/100)*'Base Values'!$B$12/100,0))","v":""},{"$f":"IF(LEN(B500)=0,\"\",ROUND(B500*'Base Values'!$B$14,0))","v":""},""]

{"sheet":"Charts - Loan Value","index":4,"n_rows":7,"n_cols":12,"rows_kept":7,"cut":false,"hidden":false,"merged":[]}
[]
[]
[]
[]
[]
[null,null,null,null,null,null,null,null,null,null,null,{"$f":"CONCATENATE('Base Values'!$B$6,\" - Loan Values (cents/lb)\")","v":"2017/18 Sample Loan Values - Loan Values (cents/lb)"}]
[null,null,null,null,null,null,null,null,null,null,null,"cents/lb"]

{"sheet":"Charts - Net Return","index":5,"n_rows":37,"n_cols":20,"rows_kept":37,"cut":false,"hidden":false,"merged":[]}
[]
[]
[]
[]
[]
[]
[null,null,null,null,null,null,null,null,null,null,null,null,null,null,null,null,null,null,null,{"$f":"CONCATENATE('Base Values'!$B$6,\" - Loan Values (cents/lb)\")","v":"2017/18 Sample Loan Values - Loan Values (cents/lb)"}]
[null,null,null,null,null,null,null,null,null,null,null,null,null,null,null,null,null,null,null,"cents/lb"]
[]
[null,null,null,null,null,null,null,null,null,null,null,null,null,null,null,null,null,null,null,{"$f":"CONCATENATE('Base Values'!$B$6,\" - Lint Yield (lb/acre)\")","v":"2017/18 Sample Loan Values - Lint Yield (lb/acre)"}]
[null,null,null,null,null,null,null,null,null,null,null,null,null,null,null,null,null,null,null,"lb/acre"]
[]
[]
[]
[]
[]
[]
[]
[]
[]
[]
[null,null,null,null,null,null,null,null,null,null,null,null,null,null,null,null,null,null,null,{"$f":"CONCATENATE('Base Values'!$B$6,\" - Gross Return (lint & seed, $/acre)\")","v":"2017/18 Sample Loan Values - Gross Return (lint & seed, $/acre)"}]
[null,null,null,null,null,null,null,null,null,null,null,null,null,null,null,null,null,null,null,"$/acre"]
[]
[null,null,null,null,null,null,null,null,null,null,null,null,null,null,null,null,null,null,null,{"$f":"CONCATENATE('Base Values'!$B$6,\" - Net Return\n(lint & seed value above harvesting & ginning costs, $/acre)\")","v":"2017/18 Sample Loan Values - Net Return\n(lint & seed value above harvesting & ginning costs, $/acre)"}]
[null,null,null,null,null,null,null,null,null,null,null,null,null,null,null,null,null,null,null,"$/acre"]
[]
[]
[]
[]
[]
[]
[]
[]
[]
[]
[null,null,null,null,null,null,null,null,null,null,"Note: Net return refers to the return above harvesting and ginning costs."]

{"sheet":"Loan - Grade & Staple & Leaf","index":6,"n_rows":24,"n_cols":15,"rows_kept":24,"cut":false,"hidden":true,"merged":[[12,12,12,13]]}
[]
[]
[null,"Color",44,46,48,null,"Leaf","Leaf Discount","Color"]
[null,1,76.900000000000006,81.150000000000006,81.349999999999994,null,1,0,"All"]
[null,2,76.599999999999994,80.849999999999994,81.099999999999994,null,2,0,"All"]
[null,3,71.900000000000006,76.05,76.2,null,3,-3.45,"1-3"]
[null,4,56.1,60.25,60.25,null,4,-3.6,"1-3"]
[null,5,46.75,48.65,48.65,null,5,-3.7,"1-4"]
[null,6,41.8,43.15,43.15,null,6,-3.8,"1-5"]
[null,7,37,37,37,null,7,-3.8,"1-6"]
[]
[]
[null,null,null,null,null,null,null,null,null,null,null,null,"for reference"]
[null,null,null,null,null,null,null,null,null,null,null,null,"Color","Leaf","Leaf Discount"]
[null,null,null,null,null,null,null,null,null,null,null,{"$f":"'HVI Quality Data'!A15","v":"Variety 1"},{"$f":"'HVI Quality Data'!B15","v":1},{"$f":"'HVI Quality Data'!C15","v":1},{"$f":"IF('HVI Quality Data'!C15<=2,0,IF(AND('HVI Quality Data'!C15=3,'HVI Quality Data'!B15<=3),$H$6,IF(AND('HVI Quality Data'!C15=4,'HVI Quality Data'!B15<=3),$H$7,IF(AND('HVI Quality Data'!C15=5,'HVI Quality Data'!B15<=4),$H$8,IF(AND('HVI Quality Data'!C15=6,'HVI Quality Data'!B15<=5),$H$9,IF(AND('HVI Quality Data'!C15>=7,'HVI Quality Data'!B15<=6),$H$10,0))))))","v":0}]
[null,null,null,null,null,null,null,null,null,null,null,{"$f":"'HVI Quality Data'!A16","v":"Variety 2"},{"$f":"'HVI Quality Data'!B16","v":1},{"$f":"'HVI Quality Data'!C16","v":2},{"$f":"IF('HVI Quality Data'!C16<=2,0,IF(AND('HVI Quality Data'!C16=3,'HVI Quality Data'!B16<=3),$H$6,IF(AND('HVI Quality Data'!C16=4,'HVI Quality Data'!B16<=3),$H$7,IF(AND('HVI Quality Data'!C16=5,'HVI Quality Data'!B16<=4),$H$8,IF(AND('HVI Quality Data'!C16=6,'HVI Quality Data'!B16<=5),$H$9,IF(AND('HVI Quality Data'!C16>=7,'HVI Quality Data'!B16<=6),$H$10,0))))))","v":0}]
[null,null,null,null,null,null,null,null,null,null,null,{"$f":"'HVI Quality Data'!A17","v":"Variety 3"},{"$f":"'HVI Quality Data'!B17","v":2},{"$f":"'HVI Quality Data'!C17","v":3},{"$f":"IF('HVI Quality Data'!C17<=2,0,IF(AND('HVI Quality Data'!C17=3,'HVI Quality Data'!B17<=3),$H$6,IF(AND('HVI Quality Data'!C17=4,'HVI Quality Data'!B17<=3),$H$7,IF(AND('HVI Quality Data'!C17=5,'HVI Quality Data'!B17<=4),$H$8,IF(AND('HVI Quality Data'!C17=6,'HVI Quality Data'!B17<=5),$H$9,IF(AND('HVI Quality Data'!C17>=7,'HVI Quality Data'!B17<=6),$H$10,0))))))","v":-3.45}]
[null,null,null,null,null,null,null,null,null,null,null,{"$f":"'HVI Quality Data'!A18","v":"Variety 4"},{"$f":"'HVI Quality Data'!B18","v":3},{"$f":"'HVI Quality Data'!C18","v":4},{"$f":"IF('HVI Quality Data'!C18<=2,0,IF(AND('HVI Quality Data'!C18=3,'HVI Quality Data'!B18<=3),$H$6,IF(AND('HVI Quality Data'!C18=4,'HVI Quality Data'!B18<=3),$H$7,IF(AND('HVI Quality Data'!C18=5,'HVI Quality Data'!B18<=4),$H$8,IF(AND('HVI Quality Data'!C18=6,'HVI Quality Data'!B18<=5),$H$9,IF(AND('HVI Quality Data'!C18>=7,'HVI Quality Data'!B18<=6),$H$10,0))))))","v":-3.6}]
[null,null,null,null,null,null,null,null,null,null,null,{"$f":"'HVI Quality Data'!A19","v":"Variety 5"},{"$f":"'HVI Quality Data'!B19","v":1},{"$f":"'HVI Quality Data'!C19","v":5},{"$f":"IF('HVI Quality Data'!C19<=2,0,IF(AND('HVI Quality Data'!C19=3,'HVI Quality Data'!B19<=3),$H$6,IF(AND('HVI Quality Data'!C19=4,'HVI Quality Data'!B19<=3),$H$7,IF(AND('HVI Quality Data'!C19=5,'HVI Quality Data'!B19<=4),$H$8,IF(AND('HVI Quality Data'!C19=6,'HVI Quality Data'!B19<=5),$H$9,IF(AND('HVI Quality Data'!C19>=7,'HVI Quality Data'!B19<=6),$H$10,0))))))","v":-3.7}]
[null,null,null,null,null,null,null,null,null,null,null,{"$f":"'HVI Quality Data'!A20","v":"Variety 6"},{"$f":"'HVI Quality Data'!B20","v":2},{"$f":"'HVI Quality Data'!C20","v":6},{"$f":"IF('HVI Quality Data'!C20<=2,0,IF(AND('HVI Quality Data'!C20=3,'HVI Quality Data'!B20<=3),$H$6,IF(AND('HVI Quality Data'!C20=4,'HVI Quality Data'!B20<=3),$H$7,IF(AND('HVI Quality Data'!C20=5,'HVI Quality Data'!B20<=4),$H$8,IF(AND('HVI Quality Data'!C20=6,'HVI Quality Data'!B20<=5),$H$9,IF(AND('HVI Quality Data'!C20>=7,'HVI Quality Data'!B20<=6),$H$10,0))))))","v":-3.8}]
[null,null,null,null,null,null,null,null,null,null,null,{"$f":"'HVI Quality Data'!A21","v":"Variety 7"},{"$f":"'HVI Quality Data'!B21","v":3},{"$f":"'HVI Quality Data'!C21","v":7},{"$f":"IF('HVI Quality Data'!C21<=2,0,IF(AND('HVI Quality Data'!C21=3,'HVI Quality Data'!B21<=3),$H$6,IF(AND('HVI Quality Data'!C21=4,'HVI Quality Data'!B21<=3),$H$7,IF(AND('HVI Quality Data'!C21=5,'HVI Quality Data'!B21<=4),$H$8,IF(AND('HVI Quality Data'!C21=6,'HVI Quality Data'!B21<=5),$H$9,IF(AND('HVI Quality Data'!C21>=7,'HVI Quality Data'!B21<=6),$H$10,0))))))","v":-3.8}]
[null,null,null,null,null,null,null,null,null,null,null,{"$f":"'HVI Quality Data'!A22","v":"Variety 8"},{"$f":"'HVI Quality Data'!B22","v":1},{"$f":"'HVI Quality Data'!C22","v":1},{"$f":"IF('HVI Quality Data'!C22<=2,0,IF(AND('HVI Quality Data'!C22=3,'HVI Quality Data'!B22<=3),$H$6,IF(AND('HVI Quality Data'!C22=4,'HVI Quality Data'!B22<=3),$H$7,IF(AND('HVI Quality Data'!C22=5,'HVI Quality Data'!B22<=4),$H$8,IF(AND('HVI Quality Data'!C22=6,'HVI Quality Data'!B22<=5),$H$9,IF(AND('HVI Quality Data'!C22>=7,'HVI Quality Data'!B22<=6),$H$10,0))))))","v":0}]
[null,null,null,null,null,null,null,null,null,null,null,{"$f":"'HVI Quality Data'!A23","v":"Variety 9"},{"$f":"'HVI Quality Data'!B23","v":2},{"$f":"'HVI Quality Data'!C23","v":2},{"$f":"IF('HVI Quality Data'!C23<=2,0,IF(AND('HVI Quality Data'!C23=3,'HVI Quality Data'!B23<=3),$H$6,IF(AND('HVI Quality Data'!C23=4,'HVI Quality Data'!B23<=3),$H$7,IF(AND('HVI Quality Data'!C23=5,'HVI Quality Data'!B23<=4),$H$8,IF(AND('HVI Quality Data'!C23=6,'HVI Quality Data'!B23<=5),$H$9,IF(AND('HVI Quality Data'!C23>=7,'HVI Quality Data'!B23<=6),$H$10,0))))))","v":0}]
[null,null,null,null,null,null,null,null,null,null,null,{"$f":"'HVI Quality Data'!A24","v":"Variety 10"},{"$f":"'HVI Quality Data'!B24","v":3},{"$f":"'HVI Quality Data'!C24","v":3},{"$f":"IF('HVI Quality Data'!C24<=2,0,IF(AND('HVI Quality Data'!C24=3,'HVI Quality Data'!B24<=3),$H$6,IF(AND('HVI Quality Data'!C24=4,'HVI Quality Data'!B24<=3),$H$7,IF(AND('HVI Quality Data'!C24=5,'HVI Quality Data'!B24<=4),$H$8,IF(AND('HVI Quality Data'!C24=6,'HVI Quality Data'!B24<=5),$H$9,IF(AND('HVI Quality Data'!C24>=7,'HVI Quality Data'!B24<=6),$H$10,0))))))","v":-3.45}]

{"sheet":"Loan - Strength","index":7,"n_rows":7,"n_cols":3,"rows_kept":7,"cut":false,"hidden":true,"merged":[]}
["Strength"]
["Lower","Upper","Points"]
[0,35.299999999999997,-1350]
[35.4,35.5,-1350]
[35.5,36.4,-1100]
[36.5,37.4,-850]
[37.5,200,0]

{"sheet":"Loan - Micronaire","index":8,"n_rows":8,"n_cols":3,"rows_kept":8,"cut":false,"hidden":true,"merged":[]}
["Micronaire"]
["Lower","Upper","Points"]
[0,2.5,-1915]
[2.6,2.7,-1915]
[2.7,2.9,-1420]
[3,3.2,-920]
[3.3,3.4,-415]
[3.5,200,0]

{"sheet":"Loan - Extraneous","index":9,"n_rows":4,"n_cols":3,"rows_kept":4,"cut":false,"hidden":true,"merged":[]}
["Extraneous Matter"]
[null,"Level 1","Level 2"]
["Prep All Locations",-810,-1095]
["Other",-715,-1035]